Run of fresh-snapshots for libksysguard

Try this locally (using silver-platter):

debian-svp new-upstream --snapshot libksysguard 
5040
5041
5042
5043
5044
5045
5046
5047
5048
5049
5050
5051
5052
5053
5054
dh_install: warning: libkf5sysguard-data missing files: usr/share/locale/*/*/ksysguard_face_org.kde.ksysguard.piechart.mo
dh_install: warning: Cannot find (any matches for) "usr/share/locale/*/*/ksysguard_face_org.kde.ksysguard.barchart.mo" (tried in ., debian/tmp)

dh_install: warning: libkf5sysguard-data missing files: usr/share/locale/*/*/ksysguard_face_org.kde.ksysguard.barchart.mo
dh_install: warning: Cannot find (any matches for) "usr/share/locale/*/*/ksysguard_face_org.kde.ksysguard.textonly.mo" (tried in ., debian/tmp)

dh_install: warning: libkf5sysguard-data missing files: usr/share/locale/*/*/ksysguard_face_org.kde.ksysguard.textonly.mo
dh_install: warning: Cannot find (any matches for) "usr/share/locale/*/*/KSysGuardSensorFaces.mo" (tried in ., debian/tmp)

dh_install: warning: libkf5sysguard-data missing files: usr/share/locale/*/*/KSysGuardSensorFaces.mo
dh_install: error: missing files, aborting
make: *** [debian/rules:6: binary] Error 25
dpkg-buildpackage: error: debian/rules binary subprocess returned exit status 2
--------------------------------------------------------------------------------
Build finished at 2021-04-04T20:03:27Z

Summary

Merged new upstream version: 5.20.90+git20210325.1.66882a0 (was: 5.20.5).

Full worker log Full build log