Run of fresh-releases for libreadline-java

Try this locally (using silver-platter):

debian-svp new-upstream libreadline-java 
1
2
3
4
5
6
7
8
9
10
11
12
13
14
15
16
17
18
19
20
21
22
23
24
25
26
27
28
29
30
31
32
33
34
35
36
37
38
39
40
41
42
43
44
45
46
47
48
49
50
51
52
53
54
55
56
57
58
59
60
61
62
63
64
65
66
67
68
69
70
71
72
73
74
75
76
Processing: libreadline-java
Total 0 (delta 0), reused 0 (delta 0)

Using upstream branch https://github.com/aclemons/java-readline (guessed)
Total 1103 (delta 15), reused 14 (delta 14), pack-reused 1087
Using version string 0.8.2.
No upstream upstream-revision format specified, trying tag:0.8.2
No upstream upstream-revision format specified, trying tag:libreadline-java-0.8.2
No upstream upstream-revision format specified, trying tag:v0.8.2
Using uscan to look for the upstream tarball.
uscan warn: Files-Excluded pattern (contrib/) should not have a trailing /
Total 1091 (delta 88), reused 87 (delta 87), pack-reused 1001
R_0_4_3 does not point to a valid object
R_0_5 does not point to a valid object
Not storing pristine-tar metadata, since there is no pristine-tar branch.
All changes applied successfully.
Committing to: /home/janitor/tmp/tmpac1uin32/libreadline-java/
added .gitignore
added .travis.yml
modified COPYING.LIB
deleted ChangeLog
modified Makefile
modified NEWS
modified README
deleted TODO
added TODO.md
modified VERSION
modified debian/changelog
modified etc/libreadline-java.spec
added misc
added misc/release-checklist.txt
modified src/Makefile
modified src/native/Makefile
modified src/native/getline.c
modified src/native/getline.h
modified src/native/org_gnu_readline_Readline.c
modified src/org/gnu/readline/Readline.java
modified src/org/gnu/readline/ReadlineCompleter.java
modified src/org/gnu/readline/ReadlineConstBase.java
modified src/org/gnu/readline/ReadlineConstInt.java
modified src/org/gnu/readline/ReadlineConstString.java
modified src/org/gnu/readline/ReadlineLibrary.java
modified src/org/gnu/readline/ReadlineReader.java
added src/test/BatsTestReader.java
added src/test/BatsTestVar.java
modified src/test/Makefile
modified src/test/ReadlineTest.java
modified src/test/TestCompleter.java
added src/test/test.bats
added web
added web/index-dutch.html
added web/index.html
Committed revision 53.
Worker failed: An error (1) occurred refreshing quilt patches: None

Applying patch debian/patches/add-editline.patch
patching file src/org/gnu/readline/Readline.java
Hunk #1 FAILED at 79.
Hunk #2 FAILED at 95.
Hunk #3 FAILED at 127.
Hunk #4 FAILED at 175.
Hunk #5 FAILED at 191.
Hunk #6 FAILED at 207.
Hunk #7 FAILED at 255.
Hunk #8 FAILED at 398.
Hunk #9 FAILED at 414.
Hunk #10 FAILED at 654.
Hunk #11 FAILED at 670.
Hunk #12 FAILED at 702.
Hunk #13 FAILED at 750.
Hunk #14 FAILED at 766.
Hunk #15 FAILED at 782.
15 out of 15 hunks FAILED -- rejects in file src/org/gnu/readline/Readline.java
Patch debian/patches/add-editline.patch does not apply (enforce with -f)

Elapsed time: 0:00:49.166328

Full worker log