Run of fresh-releases for lz4

Try this locally (using silver-platter):

debian-svp new-upstream lz4 
1
2
3
4
5
6
7
8
9
10
11
12
13
14
15
16
17
18
19
20
21
22
23
24
25
26
27
28
29
30
31
32
33
34
35
36
37
38
39
40
41
42
43
44
45
46
47
48
49
50
51
52
53
54
55
56
57
58
59
60
61
62
63
64
65
66
67
68
69
70
71
72
73
74
75
76
77
78
79
80
81
82
83
84
85
86
87
88
89
90
91
92
93
94
95
96
97
98
99
100
101
102
103
104
105
106
107
108
109
110
111
112
113
114
115
116
117
118
119
120
121
122
123
124
125
126
127
128
129
130
131
132
133
134
135
136
137
138
139
140
141
142
143
144
145
146
147
148
149
150
151
Processing: lz4
Total 0 (delta 0), reused 0 (delta 0)
Using upstream branch https://github.com/Cyan4973/lz4 (guessed)
Total 1741 (delta 612), reused 621 (delta 609), pack-reused 1115
Using version string 1.9.1.
No upstream upstream-revision format specified, trying tag:1.9.1
No upstream upstream-revision format specified, trying tag:lz4-1.9.1
No upstream upstream-revision format specified, trying tag:v1.9.1
Using uscan to look for the upstream tarball.
r116 does not point to a valid object
Not storing pristine-tar metadata, since there is no pristine-tar branch.
All changes applied successfully.
Committing to: /home/janitor/tmp/tmpy9p7z674/lz4/
modified .gitignore
modified .travis.yml
modified Makefile
added Makefile.inc
modified NEWS
modified README.md
modified contrib/gen_manual/gen_manual.cpp
added contrib/meson
added contrib/meson/GetLz4LibraryVersion.py
added contrib/meson/InstallSymlink.py
added contrib/meson/README.md
added contrib/meson/contrib
added contrib/meson/contrib/gen_manual
added contrib/meson/contrib/gen_manual/meson.build
added contrib/meson/contrib/meson.build
added contrib/meson/examples
added contrib/meson/examples/meson.build
added contrib/meson/lib
added contrib/meson/lib/meson.build
added contrib/meson/meson.build
added contrib/meson/meson_options.txt
added contrib/meson/programs
added contrib/meson/programs/meson.build
added contrib/meson/tests
added contrib/meson/tests/meson.build
added contrib/snap
added contrib/snap/README.md
added contrib/snap/snapcraft.yaml
modified debian/changelog
deleted doc/images
deleted doc/images/usingCDict_1_8_2.png
modified doc/lz4_Block_format.md
modified doc/lz4_Frame_format.md
modified doc/lz4_manual.html
modified doc/lz4frame_manual.html
modified examples/Makefile
modified examples/blockStreaming_doubleBuffer.c
modified examples/blockStreaming_lineByLine.c
modified examples/compress_functions.c
modified examples/dictionaryRandomAccess.c
modified examples/frameCompress.c
modified examples/simple_buffer.c
modified lib/Makefile
modified lib/README.md
modified lib/dll/example/fullbench-dll.sln
modified lib/dll/example/fullbench-dll.vcxproj
deleted lib/dll/liblz4.def
added lib/liblz4-dll.rc.in
modified lib/lz4.c
modified lib/lz4.h
modified lib/lz4frame.c
modified lib/lz4frame.h
modified lib/lz4hc.c
modified lib/lz4hc.h
modified lib/xxhash.c
modified lib/xxhash.h
modified programs/Makefile
modified programs/README.md
modified programs/bench.c
added programs/lz4-exe.rc.in
modified programs/lz4.1
modified programs/lz4.1.md
modified programs/lz4cli.c
modified programs/lz4io.c
modified programs/lz4io.h
modified programs/util.h
modified tests/.gitignore
modified tests/Makefile
added tests/checkFrame.c
modified tests/frametest.c
modified tests/fullbench.c
modified tests/fuzzer.c
added tests/test_custom_block_sizes.sh
modified visual/VS2010/datagen/datagen.vcxproj
modified visual/VS2010/frametest/frametest.vcxproj
modified visual/VS2010/fullbench/fullbench.vcxproj
modified visual/VS2010/fullbench-dll/fullbench-dll.vcxproj
modified visual/VS2010/fuzzer/fuzzer.vcxproj
modified visual/VS2010/liblz4/liblz4.vcxproj
modified visual/VS2010/liblz4-dll/liblz4-dll.rc
modified visual/VS2010/liblz4-dll/liblz4-dll.vcxproj
modified visual/VS2010/lz4/lz4.rc
modified visual/VS2010/lz4/lz4.vcxproj
modified visual/VS2010/lz4.sln
modified visual/VS2017/datagen/datagen.vcxproj
modified visual/VS2017/frametest/frametest.vcxproj
modified visual/VS2017/fullbench/fullbench.vcxproj
modified visual/VS2017/fullbench-dll/fullbench-dll.vcxproj
modified visual/VS2017/fuzzer/fuzzer.vcxproj
modified visual/VS2017/liblz4/liblz4.vcxproj
modified visual/VS2017/liblz4-dll/liblz4-dll.rc
modified visual/VS2017/liblz4-dll/liblz4-dll.vcxproj
modified visual/VS2017/lz4.sln
Committed revision 144.
Worker failed: An error (1) occurred refreshing quilt patches: None

Applying patch debian/patches/0001-Show-build-info.patch
patching file Makefile
Hunk #1 succeeded at 49 (offset -9 lines).
Hunk #2 FAILED at 73.
Hunk #3 succeeded at 89 (offset -5 lines).
Hunk #4 succeeded at 114 (offset -5 lines).
Hunk #5 succeeded at 127 (offset -5 lines).
Hunk #6 succeeded at 152 with fuzz 1.
1 out of 6 hunks FAILED -- rejects in file Makefile
patching file contrib/djgpp/Makefile
patching file contrib/gen_manual/Makefile
patching file examples/Makefile
Hunk #1 succeeded at 77 (offset -9 lines).
patching file lib/Makefile
Hunk #1 FAILED at 93.
Hunk #2 succeeded at 130 with fuzz 2 (offset 13 lines).
Hunk #3 succeeded at 164 with fuzz 1 (offset 5 lines).
Hunk #4 FAILED at 169.
Hunk #5 FAILED at 179.
Hunk #6 succeeded at 213 (offset 18 lines).
3 out of 6 hunks FAILED -- rejects in file lib/Makefile
patching file lib/dll/example/Makefile
patching file programs/Makefile
Hunk #1 FAILED at 100.
Hunk #2 FAILED at 145.
2 out of 2 hunks FAILED -- rejects in file programs/Makefile
patching file tests/Makefile
Hunk #1 FAILED at 110.
Hunk #2 succeeded at 168 with fuzz 2 (offset 11 lines).
Hunk #3 succeeded at 184 (offset 11 lines).
Hunk #4 FAILED at 186.
Hunk #5 succeeded at 270 (offset 34 lines).
Hunk #6 FAILED at 273.
Hunk #7 succeeded at 330 (offset 40 lines).
Hunk #8 FAILED at 300.
Hunk #9 succeeded at 392 (offset 43 lines).
Hunk #10 succeeded at 416 (offset 43 lines).
Hunk #11 succeeded at 450 (offset 43 lines).
4 out of 11 hunks FAILED -- rejects in file tests/Makefile
Patch debian/patches/0001-Show-build-info.patch does not apply (enforce with -f)

Elapsed time: 0:01:05.734239

Full worker log