Run of fresh-snapshots for minetest-mod-mesecons

Try this locally (using silver-platter):

debian-svp new-upstream --snapshot minetest-mod-mesecons 
535
536
537
538
539
540
541
542
543
544
545
546
547
548
549
 fakeroot debian/rules binary
dh binary
   dh_testroot
   dh_prep
   debian/rules override_dh_install
make[1]: Entering directory '/<<PKGBUILDDIR>>'
dh_install
dh_install: Cannot find (any matches for) "modpack.txt" (tried in ., debian/tmp)

dh_install: minetest-mod-mesecons missing files: modpack.txt
dh_install: missing files, aborting
make[1]: *** [debian/rules:7: override_dh_install] Error 255
make[1]: Leaving directory '/<<PKGBUILDDIR>>'
make: *** [debian/rules:4: binary] Error 2
dpkg-buildpackage: error: fakeroot debian/rules binary subprocess returned exit status 2

Summary

Merged new upstream version: 1.2.1+git20190825.1bf862f (was: 1.2.1).

Full worker log Full build log