Run of fresh-releases for netmiko

Try this locally (using silver-platter):

debian-svp new-upstream netmiko 
278
279
280
281
282
283
284
285
286
287
288
289
dpkg-source: error: add tests/unit/__pycache__/test_utilities.cpython-38-pytest-5.1.2.pyc in debian/source/include-binaries if you want to store the modified binary in the debian tarball
dpkg-source: error: cannot represent change to tests/unit/__pycache__/test_utilities.cpython-38-pytest-6.0.2.pyc: binary file contents changed
dpkg-source: error: add tests/unit/__pycache__/test_utilities.cpython-38-pytest-6.0.2.pyc in debian/source/include-binaries if you want to store the modified binary in the debian tarball
dpkg-source: warning: executable mode 0755 of 'tests/unit/test_base_connection.py' will not be represented in diff
dpkg-source: warning: executable mode 0755 of 'tests/unit/test_ssh_autodetect.py' will not be represented in diff
dpkg-source: warning: executable mode 0755 of 'tests/unit/test_utilities.py' will not be represented in diff
dpkg-source: error: unrepresentable changes to source
dpkg-source: info: using options from netmiko-2.4.2/debian/source/options: --extend-diff-ignore=^[^/]+.egg-info/
E: Failed to open build log /home/janitor/tmp/tmpscn6if6p/build-area//home/janitor/tmp/tmpscn6if6p/build-area/netmiko_2.4.2-2~jan+nur1.dsc_amd64-2021-03-24T13:50:19Z.build: No such file or directory
print() on closed filehandle $PLOG at /usr/share/perl5/Sbuild/Base.pm line 90.
E: unable to mktemp
brz: ERROR: The build failed.

Summary

Merged new upstream version: 3.3.3 (was: 2.4.2).

Full worker log Full build log