Run of multiarch-fixes for nfstrace

Try this locally (using the package):

debcheckout nfstrace
cd nfstrace
apply-multiarch-hints
8304
8305
8306
8307
8308
8309
8310
8311
8312
8313
8314
8315
8316
8317
8318
[ 45%] Building CXX object analyzers/src/watch/CMakeFiles/watch.dir/nc_windows/header_window.cpp.o
cd /<<PKGBUILDDIR>>/obj-x86_64-linux-gnu/analyzers/src/watch && /usr/bin/c++ -Dwatch_EXPORTS -I/<<PKGBUILDDIR>>/src -I/<<PKGBUILDDIR>>/analyzers/src/watch -g -O2 -ffile-prefix-map=/<<PKGBUILDDIR>>=. -fstack-protector-strong -Wformat -Werror=format-security -Wdate-time -D_FORTIFY_SOURCE=2 -std=c++14 -pedantic -Wall -Werror -Wextra -Wno-invalid-offsetof -Wno-error=address-of-packed-member -fPIC -fvisibility=hidden -fPIC -o CMakeFiles/watch.dir/nc_windows/header_window.cpp.o -c /<<PKGBUILDDIR>>/analyzers/src/watch/nc_windows/header_window.cpp
[ 47%] Building CXX object analyzers/src/watch/CMakeFiles/watch.dir/nc_windows/main_window.cpp.o
cd /<<PKGBUILDDIR>>/obj-x86_64-linux-gnu/analyzers/src/watch && /usr/bin/c++ -Dwatch_EXPORTS -I/<<PKGBUILDDIR>>/src -I/<<PKGBUILDDIR>>/analyzers/src/watch -g -O2 -ffile-prefix-map=/<<PKGBUILDDIR>>=. -fstack-protector-strong -Wformat -Werror=format-security -Wdate-time -D_FORTIFY_SOURCE=2 -std=c++14 -pedantic -Wall -Werror -Wextra -Wno-invalid-offsetof -Wno-error=address-of-packed-member -fPIC -fvisibility=hidden -fPIC -o CMakeFiles/watch.dir/nc_windows/main_window.cpp.o -c /<<PKGBUILDDIR>>/analyzers/src/watch/nc_windows/main_window.cpp
[ 48%] Building CXX object analyzers/src/watch/CMakeFiles/watch.dir/nc_windows/statistics_window.cpp.o
cd /<<PKGBUILDDIR>>/obj-x86_64-linux-gnu/analyzers/src/watch && /usr/bin/c++ -Dwatch_EXPORTS -I/<<PKGBUILDDIR>>/src -I/<<PKGBUILDDIR>>/analyzers/src/watch -g -O2 -ffile-prefix-map=/<<PKGBUILDDIR>>=. -fstack-protector-strong -Wformat -Werror=format-security -Wdate-time -D_FORTIFY_SOURCE=2 -std=c++14 -pedantic -Wall -Werror -Wextra -Wno-invalid-offsetof -Wno-error=address-of-packed-member -fPIC -fvisibility=hidden -fPIC -o CMakeFiles/watch.dir/nc_windows/statistics_window.cpp.o -c /<<PKGBUILDDIR>>/analyzers/src/watch/nc_windows/statistics_window.cpp
/<<PKGBUILDDIR>>/analyzers/src/watch/nc_windows/statistics_window.cpp: In constructor ‘StatisticsWindow::StatisticsWindow(MainWindow&, StatisticsWindow::StatisticsContainers&)’:
/<<PKGBUILDDIR>>/analyzers/src/watch/nc_windows/statistics_window.cpp:61:20: error: ‘runtime_error’ is not a member of ‘std’
   61 |         throw std::runtime_error("Initialization of Header window failed.");
      |                    ^~~~~~~~~~~~~
make[3]: *** [analyzers/src/watch/CMakeFiles/watch.dir/build.make:111: analyzers/src/watch/CMakeFiles/watch.dir/nc_windows/statistics_window.cpp.o] Error 1
make[3]: Leaving directory '/<<PKGBUILDDIR>>/obj-x86_64-linux-gnu'
make[2]: *** [CMakeFiles/Makefile2:317: analyzers/src/watch/CMakeFiles/watch.dir/all] Error 2
make[2]: Leaving directory '/<<PKGBUILDDIR>>/obj-x86_64-linux-gnu'
make[1]: *** [Makefile:185: all] Error 2

Summary

Multi-arch fixes.

Full worker log Full build log