Run of fresh-releases for node-ansi-regex

Try this locally (using silver-platter):

debian-svp new-upstream node-ansi-regex 
1
2
3
4
5
6
7
8
9
10
11
12
13
14
15
16
17
18
19
20
21
22
23
24
25
26
27
28
29
30
31
32
33
34
35
36
37
38
39
40
41
42
43
44
45
46
47
48
49
50
51
52
53
54
55
56
57
58
59
60
61
62
63
64
65
66
67
68
69
70
71
72
73
74
75
76
77
78
79
80
81
82
83
84
85
86
87
88
89
90
91
92
93
94
95
96
97
98
99
Processing: node-ansi-regex
Total 189 (delta 86), reused 186 (delta 83)
/usr/lib/python3/dist-packages/debian/copyright.py:652: UserWarning: Fixing Format URL
  warnings.warn('Fixing Format URL')
Using upstream branch https://github.com/chalk/ansi-regex (guessed)
Total 208 (delta 7), reused 20 (delta 7), pack-reused 188
Using version string 4.1.0.
No upstream upstream-revision format specified, trying tag:4.1.0
No upstream upstream-revision format specified, trying tag:node-ansi-regex-4.1.0
No upstream upstream-revision format specified, trying tag:v4.1.0
Using uscan to look for the upstream tarball.
Total 197 (delta 1), reused 4 (delta 1), pack-reused 188
/usr/lib/python3/dist-packages/dulwich/repo.py:393: UserWarning: ref refs/tags/2.1.1 points at non-present sha c5e73080b0b8759d385a5ac9c058798bb4bb640d
  UserWarning)
/usr/lib/python3/dist-packages/dulwich/repo.py:393: UserWarning: ref refs/tags/v1.1.1 points at non-present sha 68a6a5512428cf81c7b0b93ea62bece90aa7416f
  UserWarning)
/usr/lib/python3/dist-packages/dulwich/repo.py:393: UserWarning: ref refs/tags/v1.0.0 points at non-present sha e6894f33748f2e2aac1f61baba1b43fd8ee5b15f
  UserWarning)
/usr/lib/python3/dist-packages/dulwich/repo.py:393: UserWarning: ref refs/tags/v0.1.0 points at non-present sha ad9cbe0d12ca3bdace91c63536120c03c5a77a57
  UserWarning)
/usr/lib/python3/dist-packages/dulwich/repo.py:393: UserWarning: ref refs/tags/v3.0.0 points at non-present sha 434c9572bb8ea90ee3aa0e0783ff9f51cb76bb49
  UserWarning)
/usr/lib/python3/dist-packages/dulwich/repo.py:393: UserWarning: ref refs/tags/v4.0.0 points at non-present sha cdc85f19bc91aa7c7de5f1fa6af1b6cc7a04f43d
  UserWarning)
/usr/lib/python3/dist-packages/dulwich/repo.py:393: UserWarning: ref refs/tags/2.0.0 points at non-present sha fbf53a19d29943c8f9e492ee82264147c2872507
  UserWarning)
/usr/lib/python3/dist-packages/dulwich/repo.py:393: UserWarning: ref refs/tags/v0.2.1 points at non-present sha b1ec6ac766904007844f37fabcd44cdc362b8f13
  UserWarning)
/usr/lib/python3/dist-packages/dulwich/repo.py:393: UserWarning: ref refs/tags/v0.2.0 points at non-present sha 2c95feb2baf4f696a32dc480f5c64e3328c7660a
  UserWarning)
/usr/lib/python3/dist-packages/dulwich/repo.py:393: UserWarning: ref refs/tags/v1.1.0 points at non-present sha c1226b6b7d2d2a8e3c1b00c4ace33cb65e246007
  UserWarning)
Not storing pristine-tar metadata, since there is no pristine-tar branch.
/usr/lib/python3/dist-packages/dulwich/repo.py:393: UserWarning: ref refs/tags/2.1.1 points at non-present sha c5e73080b0b8759d385a5ac9c058798bb4bb640d
  UserWarning)
/usr/lib/python3/dist-packages/dulwich/repo.py:393: UserWarning: ref refs/tags/v1.1.1 points at non-present sha 68a6a5512428cf81c7b0b93ea62bece90aa7416f
  UserWarning)
/usr/lib/python3/dist-packages/dulwich/repo.py:393: UserWarning: ref refs/tags/v1.0.0 points at non-present sha e6894f33748f2e2aac1f61baba1b43fd8ee5b15f
  UserWarning)
/usr/lib/python3/dist-packages/dulwich/repo.py:393: UserWarning: ref refs/tags/v0.1.0 points at non-present sha ad9cbe0d12ca3bdace91c63536120c03c5a77a57
  UserWarning)
/usr/lib/python3/dist-packages/dulwich/repo.py:393: UserWarning: ref refs/tags/v3.0.0 points at non-present sha 434c9572bb8ea90ee3aa0e0783ff9f51cb76bb49
  UserWarning)
/usr/lib/python3/dist-packages/dulwich/repo.py:393: UserWarning: ref refs/tags/v4.0.0 points at non-present sha cdc85f19bc91aa7c7de5f1fa6af1b6cc7a04f43d
  UserWarning)
/usr/lib/python3/dist-packages/dulwich/repo.py:393: UserWarning: ref refs/tags/2.0.0 points at non-present sha fbf53a19d29943c8f9e492ee82264147c2872507
  UserWarning)
/usr/lib/python3/dist-packages/dulwich/repo.py:393: UserWarning: ref refs/tags/v0.2.1 points at non-present sha b1ec6ac766904007844f37fabcd44cdc362b8f13
  UserWarning)
/usr/lib/python3/dist-packages/dulwich/repo.py:393: UserWarning: ref refs/tags/v0.2.0 points at non-present sha 2c95feb2baf4f696a32dc480f5c64e3328c7660a
  UserWarning)
/usr/lib/python3/dist-packages/dulwich/repo.py:393: UserWarning: ref refs/tags/v1.1.0 points at non-present sha c1226b6b7d2d2a8e3c1b00c4ace33cb65e246007
  UserWarning)
2.1.1 does not point to a valid object
v1.1.1 does not point to a valid object
v1.0.0 does not point to a valid object
v0.1.0 does not point to a valid object
v3.0.0 does not point to a valid object
v4.0.0 does not point to a valid object
2.0.0 does not point to a valid object
v4.1.0 does not point to a valid object
v0.2.1 does not point to a valid object
v0.2.0 does not point to a valid object
v1.1.0 does not point to a valid object
All changes applied successfully.
2.1.1 does not point to a valid object
v1.1.1 does not point to a valid object
v1.0.0 does not point to a valid object
v0.1.0 does not point to a valid object
v3.0.0 does not point to a valid object
v4.0.0 does not point to a valid object
2.0.0 does not point to a valid object
v4.1.0 does not point to a valid object
v0.2.1 does not point to a valid object
v0.2.0 does not point to a valid object
v1.1.0 does not point to a valid object
Committing to: /home/janitor/tmp/tmpnm2k6bqi/node-ansi-regex/
modified .gitattributes
modified .gitignore
added .npmrc
modified .travis.yml
modified debian/changelog
modified fixtures/ansi-codes.js
modified fixtures/view-codes.js
modified index.js
modified package.json
modified readme.md
modified test.js
Committed revision 18.
Worker failed: An error (1) occurred refreshing quilt patches: None

Applying patch debian/patches/00-mocha.diff
patching file test.js
Hunk #1 FAILED at 1.
Hunk #2 FAILED at 46.
2 out of 2 hunks FAILED -- rejects in file test.js
Patch debian/patches/00-mocha.diff does not apply (enforce with -f)

Elapsed time: 0:00:27.729804

Full worker log