Run of fresh-snapshots for node-bcrypt-pbkdf

894
895
896
897
898
899
900
901
902
903
904
905
906
907
908
 1: 0x7f79ba20ae58 node::Abort() [/usr/lib/x86_64-linux-gnu/libnode.so.108]
 2: 0x7f79ba1ebbfb  [/usr/lib/x86_64-linux-gnu/libnode.so.108]
 3: 0x7f79ba1ebd36 node::builtins::BuiltinLoader::BuiltinLoader() [/usr/lib/x86_64-linux-gnu/libnode.so.108]
 4: 0x7f79ba1281df  [/usr/lib/x86_64-linux-gnu/libnode.so.108]
 5: 0x7f79bc3c5cee  [/lib64/ld-linux-x86-64.so.2]
 6: 0x7f79bc3c5dd4  [/lib64/ld-linux-x86-64.so.2]
 7: 0x7f79bc3dc97a  [/lib64/ld-linux-x86-64.so.2]
dh_auto_test: error: /usr/bin/node -e require\(\"./.\"\) died with signal 6
make: *** [debian/rules:9: build] Error 25
dpkg-buildpackage: error: debian/rules build subprocess returned exit status 2
--------------------------------------------------------------------------------
Build finished at 2022-09-29T21:48:21Z

Finished
--------

Publish Blockers

  • ☒ run was not successful
  • ☑ package has not been removed from the archive
  • ☑ command has not changed
  • ☒ not yet reviewed, but review needed
  • ☑ 0 publish attempts so far.not currently attempting to back off
  • ☒ merge proposals for the package maintainer are currently being rate-limited (open: 1258, max open: 200)
  • ☒ change set 293df600-c156-4acf-b3da-7adf77d132b5 is working

Full worker log Full build log