Run of fresh-releases for node-buble

Try this locally (using silver-platter):

debian-svp new-upstream node-buble 
1
2
3
4
5
6
7
8
9
10
11
12
13
14
15
16
17
18
19
20
21
22
23
24
25
26
27
28
29
30
31
32
33
34
35
36
37
38
39
40
41
42
43
44
45
46
47
48
49
50
51
52
53
54
55
56
57
58
59
60
61
62
63
64
65
66
67
68
69
70
71
72
73
74
75
76
77
78
79
80
81
82
83
84
85
86
87
88
89
90
91
92
93
94
95
96
97
98
99
100
101
102
103
104
105
106
107
108
Processing: node-buble
75% (212/282)   
Total 683 (delta 357), reused 680 (delta 354)
Using upstream branch git+https://github.com/Rich-Harris/buble.git (guessed)
Upstream branch git+https://github.com/Rich-Harris/buble.git inaccessible; ignoring. Unsupported protocol for url "git+https://github.com/Rich-Harris/buble.git"
Using version string 0.19.7.
Using uscan to look for the upstream tarball.
Not storing pristine-tar metadata, since there is no pristine-tar branch.
All changes applied successfully.
Committing to: /home/janitor/tmp/tmpqw5um9_z/node-buble/
deleted .eslintrc
added .eslintrc.json
added .gitattributes
modified .gitignore
modified .travis.yml
modified CHANGELOG.md
added bin/.eslintrc.yaml
modified bin/buble
modified bin/handleError.js
modified bin/runBuble.js
modified bin/showHelp.js
deleted bublé.gif
modified debian/changelog
modified package-lock.json
modified package.json
modified register.js
modified rollup.create-config.js
added scripts
added scripts/.eslintrc.yaml
added scripts/run_test262.js
added scripts/test262-acorn.whitelist
added scripts/test262-data.js
modified src/index.js
modified src/program/BlockStatement.js
modified src/program/Node.js
modified src/program/types/ArrayExpression.js
modified src/program/types/ArrowFunctionExpression.js
modified src/program/types/AssignmentExpression.js
added src/program/types/AwaitExpression.js
modified src/program/types/CallExpression.js
modified src/program/types/ClassBody.js
modified src/program/types/ClassDeclaration.js
modified src/program/types/ClassExpression.js
modified src/program/types/ExportDefaultDeclaration.js
modified src/program/types/ExportNamedDeclaration.js
modified src/program/types/ForInStatement.js
modified src/program/types/ForOfStatement.js
modified src/program/types/FunctionDeclaration.js
modified src/program/types/FunctionExpression.js
added src/program/types/Import.js
modified src/program/types/ImportDeclaration.js
modified src/program/types/JSXElement.js
modified src/program/types/Literal.js
modified src/program/types/NewExpression.js
modified src/program/types/ObjectExpression.js
modified src/program/types/Property.js
deleted src/program/types/SpreadElement.js
modified src/program/types/TaggedTemplateExpression.js
modified src/program/types/TemplateLiteral.js
modified src/program/types/ThisExpression.js
modified src/program/types/VariableDeclaration.js
modified src/program/types/VariableDeclarator.js
modified src/program/types/index.js
modified src/program/types/shared/LoopStatement.js
modified src/program/types/shared/ModuleDeclaration.js
modified src/support.js
modified src/utils/CompileError.js
modified src/utils/destructure.js
modified src/utils/getSnippet.js
modified src/utils/locate.js
modified src/utils/reserved.js
modified src/utils/spread.js
added test/.eslintrc.json
added test/bundlers
added test/bundlers/index.js
added test/bundlers/rollup.config.js
added test/bundlers/webpack.js
modified test/samples/async.js
modified test/samples/block-scoping.js
modified test/samples/classes-no-named-function-expressions.js
modified test/samples/classes.js
modified test/samples/computed-properties.js
modified test/samples/destructuring.js
modified test/samples/dynamic-import.js
modified test/samples/for-of.js
modified test/samples/generators.js
added test/samples/get-set.js
added test/samples/json-superset.js
modified test/samples/misc.js
modified test/samples/modules.js
modified test/samples/object-rest-spread.js
modified test/samples/regex.js
modified test/samples/spread-operator.js
modified test/samples/template-strings.js
modified test/test.js
Committed revision 44.
Worker failed: An error (1) occurred refreshing quilt patches: None

Applying patch debian/patches/os_homedir_is_useless.patch
patching file register.js
Hunk #1 FAILED at 1.
1 out of 1 hunk FAILED -- rejects in file register.js
patching file package.json
Hunk #1 FAILED at 67.
1 out of 1 hunk FAILED -- rejects in file package.json
Patch debian/patches/os_homedir_is_useless.patch does not apply (enforce with -f)

Elapsed time: 0:00:25.621491

Full worker log