Run of fresh-snapshots for node-grunt-known-options

875
876
877
878
879
880
881
882
883
884
885
886
887
888
889
 1: 0x7f657dc9ae58 node::Abort() [/usr/lib/x86_64-linux-gnu/libnode.so.108]
 2: 0x7f657dc7bbfb  [/usr/lib/x86_64-linux-gnu/libnode.so.108]
 3: 0x7f657dc7bd36 node::builtins::BuiltinLoader::BuiltinLoader() [/usr/lib/x86_64-linux-gnu/libnode.so.108]
 4: 0x7f657dbb81df  [/usr/lib/x86_64-linux-gnu/libnode.so.108]
 5: 0x7f657fe55cee  [/lib64/ld-linux-x86-64.so.2]
 6: 0x7f657fe55dd4  [/lib64/ld-linux-x86-64.so.2]
 7: 0x7f657fe6c97a  [/lib64/ld-linux-x86-64.so.2]
dh_auto_test: error: /usr/bin/node -e require\(\"./.\"\) died with signal 6
make: *** [debian/rules:8: binary] Error 25
dpkg-buildpackage: error: debian/rules binary subprocess returned exit status 2
--------------------------------------------------------------------------------
Build finished at 2022-09-29T21:16:24Z

Finished
--------

Publish Blockers

  • ☒ run was not successful
  • ☑ package has not been removed from the archive
  • ☑ command has not changed
  • ☒ not yet reviewed, but review needed
  • ☑ 0 publish attempts so far.not currently attempting to back off
  • ☒ merge proposals for the package maintainer are currently being rate-limited (open: 1413, max open: 300)
  • ☒ change set 2e8e6f23-66bf-4fa3-a9ab-1a481a43815f is working

Full worker log Full build log