Run of fresh-snapshots for node-rollup-plugin-json

Try this locally (using silver-platter):

debian-svp new-upstream --snapshot node-rollup-plugin-json 
14
15
16
17
18
19
20
21
22
23
24
25
patching file packages/json/test/test.js
Hunk #1 FAILED at 1.
Hunk #3 FAILED at 58.
2 out of 7 hunks FAILED
dpkg-source: info: the patch has fuzz which is not allowed, or is malformed
dpkg-source: info: if patch 'switch-test-from-ava-to-tape.diff' is correctly applied by quilt, use 'quilt refresh' to update it
dpkg-source: error: LC_ALL=C patch -t -F 0 -N -p1 -u -V never -E -b -B .pc/switch-test-from-ava-to-tape.diff/ --reject-file=- < node-rollup-plugin-json-4.1.0.repack+git20210403.1.53776ee.orig.lGGp8m/debian/patches/switch-test-from-ava-to-tape.diff subprocess returned exit status 1
dpkg-source: info: unapplying switch-test-from-ava-to-tape.diff
E: Failed to open build log /tmp/tmpgx6bmr1w/build-area//tmp/tmpgx6bmr1w/build-area/node-rollup-plugin-json_4.1.0.repack+git20210403.1.53776ee-1~jan+nus1.dsc_amd64-2021-04-05T11:48:55Z.build: No such file or directory
print() on closed filehandle $PLOG at /usr/share/perl5/Sbuild/Base.pm line 90.
E: unable to mktemp
brz: ERROR: The build failed.

Summary

Merged new upstream version: 4.1.0.repack+git20210403.1.53776ee (was: 4.1.0.repack).

Full worker log Full build log Full dist log