Run of fresh-snapshots for nomad-driver-lxc

2398
2399
2400
2401
2402
2403
2404
2405
2406
2407
2408
2409
2410
2411
2412
src/github.com/hashicorp/nomad-driver-lxc/lxc/handle.go
src/github.com/hashicorp/nomad-driver-lxc/lxc/lxc.go
src/github.com/hashicorp/nomad-driver-lxc/lxc/lxc_test.go
src/github.com/hashicorp/nomad-driver-lxc/lxc/state.go
src/github.com/hashicorp/nomad-driver-lxc/version/version.go
src/github.com/hashicorp/nomad-driver-lxc/version/version_test.go
	cd _build && go install -trimpath -v -p 32 github.com/hashicorp/nomad-driver-lxc github.com/hashicorp/nomad-driver-lxc/lxc github.com/hashicorp/nomad-driver-lxc/version
src/github.com/hashicorp/nomad-driver-lxc/lxc/driver.go:16:2: cannot find package "github.com/lxc/go-lxc" in any of:
	/usr/lib/go-1.19/src/github.com/lxc/go-lxc (from $GOROOT)
	/<<PKGBUILDDIR>>/_build/src/github.com/lxc/go-lxc (from $GOPATH)
dh_auto_build: error: cd _build && go install -trimpath -v -p 32 github.com/hashicorp/nomad-driver-lxc github.com/hashicorp/nomad-driver-lxc/lxc github.com/hashicorp/nomad-driver-lxc/version returned exit code 1
make: *** [debian/rules:15: binary] Error 25
dpkg-buildpackage: error: debian/rules binary subprocess returned exit status 2
--------------------------------------------------------------------------------
Build finished at 2022-09-29T23:07:44Z

Publish Blockers

  • ☒ run was not successful
  • ☑ package has not been removed from the archive
  • ☑ command has not changed
  • ☒ not yet reviewed, but review needed
  • ☑ 0 publish attempts so far.not currently attempting to back off
  • ☒ merge proposals for the package maintainer are currently being rate-limited (open: 529, max open: 300)
  • ☒ change set 727ec932-5938-4af2-91bf-2aafe79e223c is working

Full worker log Full build log