Run of fresh-releases for onedrivesdk

Try this locally (using silver-platter):

debian-svp new-upstream onedrivesdk 
13
14
15
16
17
18
19
20
21
22
23
dpkg-source: info: using patch list from debian/patches/series
patching file setup.py
Hunk #1 FAILED at 68.
1 out of 1 hunk FAILED
dpkg-source: info: the patch has fuzz which is not allowed, or is malformed
dpkg-source: info: if patch '0001-upstream-tarball-does-not-include-tests.patch' is correctly applied by quilt, use 'quilt refresh' to update it
dpkg-source: error: LC_ALL=C patch -t -F 0 -N -p1 -u -V never -E -b -B .pc/0001-upstream-tarball-does-not-include-tests.patch/ --reject-file=- < onedrivesdk-2.0.orig.kBeC52/debian/patches/0001-upstream-tarball-does-not-include-tests.patch subprocess returned exit status 1
dpkg-source: info: using options from onedrivesdk-2.0/debian/source/options: --extend-diff-ignore=^[^/]*[.]egg-info/
E: Failed to open build log /tmp/tmpukdov23s/build-area//tmp/tmpukdov23s/build-area/onedrivesdk_2.0-1~jan+nur1.dsc_amd64-2021-03-28T16:56:32Z.build: No such file or directory
E: Error creating chroot
brz: ERROR: The build failed.

Summary

Merged new upstream version: 2.0 (was: 1.1.8).

Full worker log Full build log