Run of unchanged for plexus-io

Try this locally (using silver-platter):

debian-svp just-build plexus-io 
2118
2119
2120
2121
2122
2123
2124
2125
2126
2127
2128
2129
2130
2131
2132
2133
[INFO] Finished at: 2020-10-31T08:12:02Z
[INFO] ------------------------------------------------------------------------
[ERROR] Failed to execute goal org.apache.maven.plugins:maven-surefire-plugin:2.22.2:test (default-test) on project plexus-io: There are test failures.
[ERROR] 
[ERROR] Please refer to /<<PKGBUILDDIR>>/target/surefire-reports for the individual test results.
[ERROR] Please refer to dump files (if any exist) [date].dump, [date]-jvmRun[N].dump and [date].dumpstream.
[ERROR] -> [Help 1]
[ERROR] 
[ERROR] To see the full stack trace of the errors, re-run Maven with the -e switch.
[ERROR] Re-run Maven using the -X switch to enable full debug logging.
[ERROR] 
[ERROR] For more information about the errors and possible solutions, please read the following articles:
[ERROR] [Help 1] http://cwiki.apache.org/confluence/display/MAVEN/MojoFailureException
dh_auto_test: error: /usr/lib/jvm/default-java/bin/java -noverify -cp /usr/share/maven/boot/plexus-classworlds-2.x.jar -Dmaven.home=/usr/share/maven -Dmaven.multiModuleProjectDirectory=/<<PKGBUILDDIR>> -Dclassworlds.conf=/etc/maven/m2-debian.conf -Dproperties.file.manual=/<<PKGBUILDDIR>>/debian/maven.properties org.codehaus.plexus.classworlds.launcher.Launcher -s/etc/maven/settings-debian.xml -Ddebian.dir=/<<PKGBUILDDIR>>/debian -Dmaven.repo.local=/<<PKGBUILDDIR>>/debian/maven-repo --batch-mode test returned exit code 1
make: *** [debian/rules:4: binary] Error 25
dpkg-buildpackage: error: debian/rules binary subprocess returned exit status 2

Full build log Full worker log