Run of fresh-snapshots for plexus-utils2

Try this locally (using silver-platter):

debian-svp new-upstream --snapshot plexus-utils2 
11
12
13
14
15
16
17
18
19
20
21
dpkg-source: info: using patch list from debian/patches/series
patching file pom.xml
Hunk #1 FAILED at 69.
1 out of 1 hunk FAILED
dpkg-source: info: the patch has fuzz which is not allowed, or is malformed
dpkg-source: info: if patch '01-add-junit-dependency.patch' is correctly applied by quilt, use 'quilt refresh' to update it
dpkg-source: error: LC_ALL=C patch -t -F 0 -N -p1 -u -V never -E -b -B .pc/01-add-junit-dependency.patch/ --reject-file=- < plexus-utils2-3.3.0+git20210220.85a4a3c.orig.Lr3x_9/debian/patches/01-add-junit-dependency.patch subprocess returned exit status 1
E: Failed to open build log /tmp/tmpljvg1ub1/build-area//tmp/tmpljvg1ub1/build-area/plexus-utils2_3.3.0+git20210220.85a4a3c-1~jan+nus1.dsc_amd64-2021-03-26T18:24:01Z.build: No such file or directory
print() on closed filehandle $PLOG at /usr/share/perl5/Sbuild/Base.pm line 90.
E: unable to mktemp
brz: ERROR: The build failed.

Summary

Merged new upstream version: 3.3.0+git20210220.85a4a3c (was: 3.3.0).

Full worker log Full build log Full dist log