Run of fresh-snapshots for prometheus-postgres-exporter

Try this locally (using silver-platter):

debian-svp new-upstream --snapshot prometheus-postgres-exporter 
855
856
857
858
859
860
861
862
863
864
865
866
867
868
869
   debian/rules override_dh_auto_build
make[1]: Entering directory '/<<PKGBUILDDIR>>'
dh_auto_build -- -tags "" -ldflags " -X main.Version=0.9.0+git20210325.1.1dc2104"
	cd build && go install -trimpath -v -p 32 -tags  -ldflags " -X main.Version=0.9.0+git20210325.1.1dc2104" github.com/wrouesnel/postgres_exporter/cmd/postgres_exporter
src/github.com/wrouesnel/postgres_exporter/cmd/postgres_exporter/postgres_exporter.go:41:2: cannot find package "github.com/prometheus/exporter-toolkit/web" in any of:
	/usr/src/github.com/prometheus/exporter-toolkit/web (from $GOROOT)
	/<<PKGBUILDDIR>>/build/src/github.com/prometheus/exporter-toolkit/web (from $GOPATH)
src/github.com/wrouesnel/postgres_exporter/cmd/postgres_exporter/postgres_exporter.go:42:2: cannot find package "github.com/prometheus/exporter-toolkit/web/kingpinflag" in any of:
	/usr/src/github.com/prometheus/exporter-toolkit/web/kingpinflag (from $GOROOT)
	/<<PKGBUILDDIR>>/build/src/github.com/prometheus/exporter-toolkit/web/kingpinflag (from $GOPATH)
dh_auto_build: error: cd build && go install -trimpath -v -p 32 -tags  -ldflags " -X main.Version=0.9.0+git20210325.1.1dc2104" github.com/wrouesnel/postgres_exporter/cmd/postgres_exporter returned exit code 1
make[1]: *** [debian/rules:21: override_dh_auto_build] Error 25
make[1]: Leaving directory '/<<PKGBUILDDIR>>'
make: *** [debian/rules:14: binary] Error 2
dpkg-buildpackage: error: debian/rules binary subprocess returned exit status 2

Summary

Merged new upstream version: 0.9.0+git20210325.1.1dc2104 (was: 0.8.0+ds).

Full worker log Full build log Full dist log