Run of lintian-fixes for puppet-module-aodh

Try this locally (using the lintian-brush package):

debcheckout puppet-module-aodh
cd puppet-module-aodh
lintian-brush
670
671
672
673
674
675
676
677
678
679
680
681
682
683
684
 debian/rules build
make: pyversions: No such file or directory
py3versions: no X-Python3-Version in control file, using supported versions
dh build --buildsystem=pybuild
   dh_update_autotools_config -O--buildsystem=pybuild
   dh_autoreconf -O--buildsystem=pybuild
   dh_auto_configure -O--buildsystem=pybuild
dh_auto_configure: error: unable to load build system class 'pybuild': Can't locate Debian/Debhelper/Buildsystem/pybuild.pm in @INC (you may need to install the Debian::Debhelper::Buildsystem::pybuild module) (@INC contains: /etc/perl /usr/local/lib/x86_64-linux-gnu/perl/5.32.0 /usr/local/share/perl/5.32.0 /usr/lib/x86_64-linux-gnu/perl5/5.32 /usr/share/perl5 /usr/lib/x86_64-linux-gnu/perl-base /usr/lib/x86_64-linux-gnu/perl/5.32 /usr/share/perl/5.32 /usr/local/lib/site_perl) at (eval 2) line 1.
BEGIN failed--compilation aborted at (eval 2) line 1.

make: *** [debian/rules:7: build] Error 25
dpkg-buildpackage: error: debian/rules build subprocess returned exit status 2
--------------------------------------------------------------------------------
Build finished at 2021-01-07T22:56:35Z

Summary

Full worker log Full build log