Run of lintian-fixes for puppet-module-nova

Try this locally (using the lintian-brush package):

debcheckout puppet-module-nova
cd puppet-module-nova
lintian-brush
888
889
890
891
892
893
894
895
896
897
898
899
900
901
902
make: pyversions: No such file or directory
py3versions: no X-Python3-Version in control file, using supported versions
dh build --buildsystem=pybuild
dh: warning: The target override_dh_systemd_enable references a now obsolete command and will not be run!
   dh_update_autotools_config -O--buildsystem=pybuild
   dh_autoreconf -O--buildsystem=pybuild
   dh_auto_configure -O--buildsystem=pybuild
dh_auto_configure: error: unable to load build system class 'pybuild': Can't locate Debian/Debhelper/Buildsystem/pybuild.pm in @INC (you may need to install the Debian::Debhelper::Buildsystem::pybuild module) (@INC contains: /etc/perl /usr/local/lib/x86_64-linux-gnu/perl/5.32.0 /usr/local/share/perl/5.32.0 /usr/lib/x86_64-linux-gnu/perl5/5.32 /usr/share/perl5 /usr/lib/x86_64-linux-gnu/perl-base /usr/lib/x86_64-linux-gnu/perl/5.32 /usr/share/perl/5.32 /usr/local/lib/site_perl) at (eval 2) line 1.
BEGIN failed--compilation aborted at (eval 2) line 1.

make: *** [debian/rules:7: build] Error 25
dpkg-buildpackage: error: debian/rules build subprocess returned exit status 2
--------------------------------------------------------------------------------
Build finished at 2020-11-26T16:39:07Z

Summary

Full worker log Full build log