Run of fresh-releases for puppet-module-puppetlabs-firewall

Try this locally package):

debcheckout puppet-module-puppetlabs-firewall
cd puppet-module-puppetlabs-firewall
DEB_UPDATE_CHANGELOG=auto deb-new-upstream --refresh-patches
639
640
641
642
643
644
645
646
647
648
649
650
651
652
653
   dh_update_autotools_config
   dh_autoreconf
   create-stamp debian/debhelper-build-stamp
   dh_prep
   dh_auto_install --destdir=debian/puppet-module-puppetlabs-firewall/
   dh_install
   dh_installdocs
dh_installdocs: error: Cannot find (any matches for) "README.markdown" (tried in ., debian/tmp)

make: *** [debian/rules:3: binary] Error 25
dpkg-buildpackage: error: debian/rules binary subprocess returned exit status 2
--------------------------------------------------------------------------------
Build finished at 2022-03-16T04:34:05Z

Finished

Full worker log Full build log