Run of fresh-releases for pycairo

Try this locally (using silver-platter):

debian-svp new-upstream pycairo 
1454
1455
1456
1457
1458
1459
1460
1461
1462
1463
1464
1465
1466
1467
1468
1469
collected 258 items / 1 errors / 4 skipped / 253 selected

==================================== ERRORS ====================================
_______ ERROR collecting .pybuild/cpython3_3.8/build/tests/test_cmod.py ________
ImportError while importing test module '/<<PKGBUILDDIR>>/.pybuild/cpython3_3.8/build/tests/test_cmod.py'.
Hint: make sure your test modules/packages have valid Python names.
Traceback:
tests/test_cmod.py:7: in <module>
    from . import cmod
E   ImportError: cannot import name 'cmod' from 'tests' (/<<PKGBUILDDIR>>/.pybuild/cpython3_3.8/build/tests/__init__.py)
!!!!!!!!!!!!!!!!!!! Interrupted: 1 errors during collection !!!!!!!!!!!!!!!!!!!!
====================== 4 skipped, 1 error in 0.66 seconds ======================
E: pybuild pybuild:352: test: plugin distutils failed with: exit code=2: cd /<<PKGBUILDDIR>>/.pybuild/cpython3_3.8/build; python3.8 -m pytest tests
dh_auto_test: error: pybuild --test --test-pytest -i python{version} -p 3.8 returned exit code 13
make: *** [debian/rules:4: build] Error 25
dpkg-buildpackage: error: debian/rules build subprocess returned exit status 2

Summary

Merged new upstream version: 1.19.1 (was: 1.16.2).

Full build log Full worker log