Run of fresh-snapshots for pycodestyle

Try this locally (using silver-platter):

debian-svp new-upstream --snapshot pycodestyle 
13
14
15
16
17
18
19
20
21
22
23
24
dpkg-source: info: using patch list from debian/patches/series
patching file setup.py
Hunk #1 FAILED at 63.
1 out of 1 hunk FAILED
dpkg-source: info: the patch has fuzz which is not allowed, or is malformed
dpkg-source: info: if patch 'Remove-broken-mention-of-testsuite-from-setup.py.patch' is correctly applied by quilt, use 'quilt refresh' to update it
dpkg-source: error: LC_ALL=C patch -t -F 0 -N -p1 -u -V never -E -b -B .pc/Remove-broken-mention-of-testsuite-from-setup.py.patch/ --reject-file=- < pycodestyle-2.7.0+git20210402.1.c4460cb.orig.typtMC/debian/patches/Remove-broken-mention-of-testsuite-from-setup.py.patch subprocess returned exit status 1
dpkg-source: info: using options from pycodestyle-2.7.0+git20210402.1.c4460cb/debian/source/options: --extend-diff-ignore=^[^/]*[.]egg-info/
E: Failed to open build log /tmp/tmpricxt6wu/build-area//tmp/tmpricxt6wu/build-area/pycodestyle_2.7.0+git20210402.1.c4460cb-1~jan+nus1.dsc_amd64-2021-04-05T08:45:54Z.build: No such file or directory
print() on closed filehandle $PLOG at /usr/share/perl5/Sbuild/Base.pm line 90.
E: unable to mktemp
brz: ERROR: The build failed.

Summary

Merged new upstream version: 2.7.0+git20210402.1.c4460cb (was: 2.6.0).

Full worker log Full build log Full dist log