Run of fresh-releases for pycxx

Try this locally (using silver-platter):

debian-svp new-upstream pycxx 
1
2
3
4
5
6
7
8
9
10
11
12
13
14
15
16
17
18
19
20
21
22
23
24
25
26
27
28
29
30
31
32
33
34
35
36
37
38
39
40
41
42
43
44
45
46
47
48
49
50
51
52
53
54
55
56
57
58
59
60
61
62
63
64
65
66
67
68
69
70
71
72
73
74
75
76
77
78
79
80
81
82
83
84
85
86
87
88
89
90
91
92
93
94
Processing: pycxx
git: refs/tags/debian/7.0.3-1 does not point to a valid object!
git: refs/tags/debian/7.0.3-2 does not point to a valid object!
git: refs/tags/upstream/5.3.1 does not point to a valid object!
git: refs/tags/upstream/5.3.2 does not point to a valid object!
git: refs/tags/upstream/5.3.3 does not point to a valid object!
git: refs/tags/upstream/5.3.4 does not point to a valid object!
git: refs/tags/upstream/5.3.5 does not point to a valid object!
git: refs/tags/upstream/5.3.6 does not point to a valid object!
git: refs/tags/upstream/5.4.0 does not point to a valid object!
git: refs/tags/upstream/5.4.1 does not point to a valid object!
git: refs/tags/upstream/5.4.2 does not point to a valid object!
git: refs/tags/upstream/5.5.0 does not point to a valid object!
git: refs/tags/upstream/6.1.1 does not point to a valid object!
git: refs/tags/upstream/6.2.0 does not point to a valid object!
git: refs/tags/upstream/6.2.3 does not point to a valid object!
git: refs/tags/upstream/6.2.4 does not point to a valid object!
git: refs/tags/upstream/6.2.5 does not point to a valid object!
git: refs/tags/upstream/6.2.6 does not point to a valid object!
Total 1238 (delta 0), reused 1238 (delta 0)
/usr/lib/python3/dist-packages/pkginfo/develop.py:45: UserWarning: No PKG-INFO found for path: /home/janitor/tmp/tmp33iux9tg/pycxx
  warnings.warn('No PKG-INFO found for path: %s' % self.path)
Using version string 7.1.2.
Using uscan to look for the upstream tarball.
Not storing pristine-tar metadata, since there is no pristine-tar branch.
All changes applied successfully.
Committing to: /home/janitor/tmp/tmp33iux9tg/pycxx/
modified CXX/Python2/Exception.hxx
modified CXX/Python2/PythonType.hxx
modified CXX/Python3/Config.hxx
modified CXX/Python3/Exception.hxx
modified CXX/Python3/ExtensionOldType.hxx
modified CXX/Python3/ExtensionType.hxx
modified CXX/Python3/ExtensionTypeBase.hxx
modified CXX/Python3/IndirectPythonInterface.hxx
modified CXX/Python3/Objects.hxx
modified CXX/Python3/PythonType.hxx
modified CXX/Python3/cxx_standard_exceptions.hxx
modified CXX/Version.hxx
modified Demo/Python2/pycxx_iter.cxx
modified Demo/Python2/range.cxx
modified Demo/Python2/test_pycxx_iter.py
modified Demo/Python3/example.cxx
modified Demo/Python3/pycxx_iter.cxx
modified Demo/Python3/range.cxx
modified Demo/Python3/simple.cxx
modified Demo/Python3/test_example.py
modified Demo/Python3/test_pycxx_iter.py
modified Demo/Python3/test_simple.py
modified Doc/Python2/PyCXX.html
modified Doc/Python3/PyCXX.html
modified PyCXX-Release-Notes.txt
modified README.html
modified README.txt
deleted SourceForge
deleted SourceForge/PyCXX-Python2.html
deleted SourceForge/PyCXX-Python3.html
deleted SourceForge/README.html
deleted SourceForge/deploy.sh
deleted SourceForge/index.html
deleted SourceForge/style.css
modified Src/IndirectPythonInterface.cxx
modified Src/Python3/cxx_extensions.cxx
modified Src/Python3/cxxsupport.cxx
modified build-all.cmd
modified build-all.sh
added build-limited-api.cmd
added build-limited-api.sh
added build-unlimited-api.cmd
added build-unlimited-api.sh
modified debian/changelog
modified how_to_release_pycxx.txt
modified make_src_kit.py
modified setup.py
modified setup_makefile.py
Committed revision 71.
Worker failed: An error (1) occurred refreshing quilt patches: None

Applying patch debian/patches/01_change_include_paths.patch
patching file Src/cxxextensions.c
patching file Src/cxxsupport.cxx
Patch debian/patches/01_change_include_paths.patch is unchanged

Applying patch debian/patches/fix-constness-of-__Py_PackageContext.patch
patching file CXX/Python2/IndirectPythonInterface.hxx
patching file CXX/Python3/IndirectPythonInterface.hxx
Hunk #1 FAILED at 149.
1 out of 1 hunk FAILED -- rejects in file CXX/Python3/IndirectPythonInterface.hxx
patching file Src/IndirectPythonInterface.cxx
Hunk #1 FAILED at 468.
1 out of 1 hunk FAILED -- rejects in file Src/IndirectPythonInterface.cxx
Patch debian/patches/fix-constness-of-__Py_PackageContext.patch does not apply (enforce with -f)

Elapsed time: 0:00:36.114374

Full worker log