Run of fresh-releases for pypy

Try this locally (using silver-platter):

debian-svp new-upstream pypy 
1
2
3
4
5
6
7
8
9
10
11
12
13
14
15
16
17
18
19
20
21
22
23
24
25
26
27
28
29
30
31
32
33
34
35
36
37
38
39
40
41
42
43
44
45
46
47
48
49
50
51
52
53
54
55
56
57
58
59
60
61
62
63
64
65
66
67
68
69
70
71
72
73
74
75
76
77
78
79
80
81
82
83
84
85
86
87
88
89
90
91
92
93
94
95
96
97
98
99
100
101
102
103
104
105
106
107
108
109
110
111
112
113
114
115
116
117
118
119
120
121
122
123
124
125
126
127
128
129
130
131
132
133
134
135
136
137
138
139
140
141
142
143
144
145
146
147
148
149
150
151
152
153
154
155
156
157
158
159
160
161
162
163
164
165
166
167
168
169
170
171
172
173
174
175
176
177
178
179
180
181
182
183
184
185
186
187
188
189
190
191
192
193
194
195
196
197
198
199
200
201
202
203
204
205
206
207
208
209
210
211
212
213
214
215
216
217
218
219
220
221
222
223
224
225
226
227
228
229
230
231
232
233
234
235
236
237
238
239
240
241
242
243
244
245
246
247
248
249
250
251
252
253
254
255
256
257
258
259
260
261
262
263
264
265
266
267
268
269
270
271
272
273
274
275
276
277
278
279
280
281
282
283
284
285
286
287
288
289
290
291
292
293
294
295
296
297
298
299
300
301
302
303
304
305
306
307
308
309
310
311
312
313
314
315
316
317
318
319
320
321
322
323
324
325
326
327
328
329
330
331
332
333
334
335
336
337
338
339
340
341
342
343
344
345
346
347
348
349
350
351
352
353
354
355
356
357
358
359
360
361
362
363
364
365
366
367
368
369
370
371
372
373
374
375
376
377
378
379
380
381
382
383
384
385
386
387
388
389
390
391
392
393
394
395
396
397
398
399
400
401
402
403
404
405
406
407
408
409
410
411
412
413
414
415
416
417
418
419
420
421
422
423
424
425
426
427
428
429
430
431
432
433
434
435
436
437
438
439
440
441
442
443
444
445
446
447
448
449
450
451
452
453
454
455
456
457
458
459
460
461
462
463
464
465
466
467
468
469
470
471
472
473
474
475
476
477
478
479
480
481
482
483
484
485
486
487
488
489
490
491
492
493
494
495
496
497
498
499
500
501
502
503
504
505
506
507
508
509
510
511
512
513
514
515
516
517
518
519
520
521
522
523
524
525
526
527
528
529
530
531
532
533
534
535
536
537
538
539
540
541
542
543
544
545
546
547
548
549
550
551
552
553
554
555
556
557
558
559
560
561
Processing: pypy
Total 32819 (delta 23601), reused 32450 (delta 23251)
Using version string 7.1.1.
Using uscan to look for the upstream tarball.
Not storing pristine-tar metadata, since there is no pristine-tar branch.
All changes applied successfully.
Committing to: /home/janitor/tmp/tmpz3krkwi7/pypy/
added .hg_archival.txt
added .hgignore
added .hgsubstate
added .hgtags
modified LICENSE
added TODO
modified debian/changelog
modified extra_tests/cffi_tests/cffi0/backend_tests.py
modified extra_tests/cffi_tests/cffi0/test_ffi_backend.py
modified extra_tests/cffi_tests/cffi0/test_function.py
modified extra_tests/cffi_tests/cffi0/test_ownlib.py
modified extra_tests/cffi_tests/cffi0/test_parsing.py
modified extra_tests/cffi_tests/cffi0/test_verify.py
modified extra_tests/cffi_tests/cffi1/test_ffi_obj.py
modified extra_tests/cffi_tests/cffi1/test_new_ffi_1.py
modified extra_tests/cffi_tests/cffi1/test_recompiler.py
modified extra_tests/cffi_tests/cffi1/test_verify1.py
modified extra_tests/cffi_tests/embedding/test_basic.py
modified extra_tests/cffi_tests/embedding/thread3-test.c
modified extra_tests/ctypes_tests/test_structures.py
modified extra_tests/requirements.txt
added lib-python/2.7/distutils/command/wininst-6.0.exe
added lib-python/2.7/distutils/command/wininst-7.1.exe
added lib-python/2.7/distutils/command/wininst-8.0.exe
added lib-python/2.7/distutils/command/wininst-9.0-amd64.exe
added lib-python/2.7/distutils/command/wininst-9.0.exe
added lib-python/2.7/ensurepip/_bundled
added lib-python/2.7/ensurepip/_bundled/pip-9.0.1-py2.py3-none-any.whl
added lib-python/2.7/ensurepip/_bundled/setuptools-28.8.0-py2.py3-none-any.whl
modified lib-python/2.7/test/test_memoryio.py
deleted lib_pypy/_csv.py
modified lib_pypy/_ctypes/array.py
modified lib_pypy/_ctypes/basics.py
modified lib_pypy/_ctypes/pointer.py
modified lib_pypy/_ctypes/structure.py
modified lib_pypy/cffi/__init__.py
modified lib_pypy/cffi/_cffi_include.h
modified lib_pypy/cffi/_embedding.h
modified lib_pypy/cffi/cparser.py
modified lib_pypy/cffi/setuptools_ext.py
modified lib_pypy/cffi.egg-info/PKG-INFO
deleted lib_pypy/pwd.py
modified pypy/conftest.py
modified pypy/doc/__pypy__-module.rst
modified pypy/doc/conf.py
modified pypy/doc/contributor.rst
modified pypy/doc/cpython_differences.rst
modified pypy/doc/extending.rst
modified pypy/doc/gc_info.rst
modified pypy/doc/how-to-release.rst
modified pypy/doc/index-of-release-notes.rst
modified pypy/doc/index.rst
modified pypy/doc/man/pypy.1.rst
modified pypy/doc/project-ideas.rst
modified pypy/doc/release-v7.0.0.rst
added pypy/doc/release-v7.1.0.rst
added pypy/doc/release-v7.1.1.rst
modified pypy/doc/tool/makecontributor.py
modified pypy/doc/whatsnew-head.rst
modified pypy/doc/whatsnew-pypy2-5.10.0.rst
modified pypy/doc/whatsnew-pypy2-6.0.0.rst
modified pypy/doc/whatsnew-pypy2-7.0.0.rst
added pypy/doc/whatsnew-pypy2-7.1.0.rst
modified pypy/interpreter/argument.py
modified pypy/interpreter/astcompiler/codegen.py
modified pypy/interpreter/astcompiler/optimize.py
modified pypy/interpreter/astcompiler/test/test_compiler.py
modified pypy/interpreter/baseobjspace.py
modified pypy/interpreter/gateway.py
modified pypy/interpreter/pyparser/parsestring.py
modified pypy/interpreter/pyparser/test/test_parsestring.py
modified pypy/interpreter/test/test_argument.py
modified pypy/interpreter/test/test_gateway.py
modified pypy/interpreter/test/test_objspace.py
modified pypy/interpreter/test/test_unicodehelper.py
modified pypy/interpreter/unicodehelper.py
modified pypy/module/__builtin__/operation.py
modified pypy/module/__builtin__/test/test_builtin.py
modified pypy/module/__pypy__/__init__.py
added pypy/module/__pypy__/interp_buffer.py
modified pypy/module/__pypy__/interp_builders.py
modified pypy/module/__pypy__/test/test_builders.py
added pypy/module/__pypy__/test/test_newmemoryview.py
modified pypy/module/_cffi_backend/__init__.py
modified pypy/module/_cffi_backend/ctypearray.py
modified pypy/module/_cffi_backend/ctypeprim.py
modified pypy/module/_cffi_backend/ctypeptr.py
modified pypy/module/_cffi_backend/ctypestruct.py
modified pypy/module/_cffi_backend/misc.py
modified pypy/module/_cffi_backend/newtype.py
modified pypy/module/_cffi_backend/test/_backend_test_c.py
modified pypy/module/_cffi_backend/test/test_c.py
added pypy/module/_cffi_backend/test/test_wchar_helper.py
modified pypy/module/_cffi_backend/wchar_helper.py
modified pypy/module/_codecs/__init__.py
modified pypy/module/_codecs/interp_codecs.py
modified pypy/module/_codecs/test/test_codecs.py
modified pypy/module/_io/interp_stringio.py
modified pypy/module/_io/interp_textio.py
modified pypy/module/_io/test/test_interp_textio.py
modified pypy/module/_io/test/test_stringio.py
deleted pypy/module/_io/test/test_ztranslation.py
modified pypy/module/_locale/interp_locale.py
modified pypy/module/_multibytecodec/c_codecs.py
modified pypy/module/_multibytecodec/interp_incremental.py
modified pypy/module/_multibytecodec/interp_multibytecodec.py
modified pypy/module/_multibytecodec/test/test_c_codecs.py
modified pypy/module/_multibytecodec/test/test_translation.py
modified pypy/module/_multiprocessing/test/test_memory.py
modified pypy/module/_multiprocessing/test/test_semaphore.py
modified pypy/module/_multiprocessing/test/test_win32.py
modified pypy/module/_pypyjson/interp_decoder.py
modified pypy/module/_pypyjson/interp_encoder.py
modified pypy/module/_pypyjson/targetjson.py
modified pypy/module/_pypyjson/test/test__pypyjson.py
modified pypy/module/_rawffi/alt/interp_funcptr.py
modified pypy/module/_rawffi/alt/test/test_type_converter.py
modified pypy/module/_rawffi/alt/type_converter.py
modified pypy/module/_rawffi/interp_rawffi.py
modified pypy/module/_rawffi/structure.py
modified pypy/module/_rawffi/test/test__rawffi.py
modified pypy/module/_sre/interp_sre.py
modified pypy/module/_sre/test/test_app_sre.py
modified pypy/module/_ssl/interp_ssl.py
modified pypy/module/_warnings/interp_warnings.py
modified pypy/module/_winreg/interp_winreg.py
modified pypy/module/array/interp_array.py
modified pypy/module/array/test/test_array.py
modified pypy/module/cpyext/api.py
modified pypy/module/cpyext/cdatetime.py
modified pypy/module/cpyext/dictobject.py
modified pypy/module/cpyext/include/patchlevel.h
modified pypy/module/cpyext/include/tupleobject.h
modified pypy/module/cpyext/listobject.py
modified pypy/module/cpyext/longobject.py
modified pypy/module/cpyext/memoryobject.py
modified pypy/module/cpyext/methodobject.py
modified pypy/module/cpyext/object.py
modified pypy/module/cpyext/parse/cpyext_memoryobject.h
modified pypy/module/cpyext/parse/cpyext_object.h
modified pypy/module/cpyext/sequence.py
modified pypy/module/cpyext/src/tupleobject.c
modified pypy/module/cpyext/test/buffer_test.c
modified pypy/module/cpyext/test/test_bytesobject.py
modified pypy/module/cpyext/test/test_codecs.py
modified pypy/module/cpyext/test/test_cpyext.py
modified pypy/module/cpyext/test/test_dictobject.py
modified pypy/module/cpyext/test/test_eval.py
modified pypy/module/cpyext/test/test_memoryobject.py
modified pypy/module/cpyext/test/test_methodobject.py
modified pypy/module/cpyext/test/test_object.py
modified pypy/module/cpyext/test/test_sequence.py
modified pypy/module/cpyext/test/test_tupleobject.py
modified pypy/module/cpyext/test/test_typeobject.py
modified pypy/module/cpyext/test/test_unicodeobject.py
modified pypy/module/cpyext/typeobject.py
modified pypy/module/cpyext/unicodeobject.py
modified pypy/module/exceptions/interp_exceptions.py
modified pypy/module/gc/referents.py
modified pypy/module/micronumpy/boxes.py
modified pypy/module/micronumpy/compile.py
modified pypy/module/micronumpy/types.py
modified pypy/module/operator/tscmp.py
modified pypy/module/posix/interp_posix.py
modified pypy/module/posix/test/test_posix2.py
modified pypy/module/pyexpat/interp_pyexpat.py
modified pypy/module/pyexpat/test/test_parser.py
modified pypy/module/pypyjit/test/test_jit_hook.py
modified pypy/module/pypyjit/test_pypy_c/test_micronumpy.py
modified pypy/module/pypyjit/test_pypy_c/test_string.py
modified pypy/module/struct/formatiterator.py
modified pypy/module/sys/version.py
modified pypy/module/sys/vm.py
modified pypy/module/test_lib_pypy/README.txt
modified pypy/module/unicodedata/interp_ucd.py
modified pypy/module/unicodedata/test/test_hyp.py
modified pypy/module/zlib/interp_zlib.py
modified pypy/module/zlib/test/test_zlib.py
modified pypy/objspace/fake/objspace.py
modified pypy/objspace/std/bytearrayobject.py
modified pypy/objspace/std/bytesobject.py
modified pypy/objspace/std/celldict.py
modified pypy/objspace/std/dictmultiobject.py
modified pypy/objspace/std/formatting.py
modified pypy/objspace/std/intobject.py
modified pypy/objspace/std/iterobject.py
modified pypy/objspace/std/listobject.py
modified pypy/objspace/std/longobject.py
modified pypy/objspace/std/marshal_impl.py
modified pypy/objspace/std/memoryobject.py
modified pypy/objspace/std/newformat.py
modified pypy/objspace/std/objspace.py
modified pypy/objspace/std/setobject.py
modified pypy/objspace/std/stringmethods.py
modified pypy/objspace/std/test/test_bytesobject.py
modified pypy/objspace/std/test/test_dictmultiobject.py
modified pypy/objspace/std/test/test_index.py
modified pypy/objspace/std/test/test_intobject.py
modified pypy/objspace/std/test/test_lengthhint.py
modified pypy/objspace/std/test/test_liststrategies.py
modified pypy/objspace/std/test/test_newformat.py
modified pypy/objspace/std/test/test_obj.py
modified pypy/objspace/std/test/test_setobject.py
modified pypy/objspace/std/test/test_setstrategies.py
modified pypy/objspace/std/test/test_unicodeobject.py
modified pypy/objspace/std/unicodeobject.py
modified pypy/tool/pytest/appsupport.py
modified pypy/tool/pytest/objspace.py
modified pypy/tool/release/package.py
modified pypy/tool/release/repackage.sh
modified rpython/annotator/binaryop.py
modified rpython/annotator/test/test_annrpython.py
modified rpython/annotator/unaryop.py
modified rpython/conftest.py
modified rpython/doc/arm.rst
modified rpython/doc/index.rst
modified rpython/jit/backend/arm/regalloc.py
modified rpython/jit/backend/arm/test/test_regalloc.py
modified rpython/jit/backend/llgraph/runner.py
modified rpython/jit/backend/llgraph/support.py
modified rpython/jit/backend/llgraph/test/test_llgraph.py
modified rpython/jit/backend/llsupport/assembler.py
modified rpython/jit/backend/llsupport/descr.py
modified rpython/jit/backend/llsupport/gc.py
modified rpython/jit/backend/llsupport/llmodel.py
modified rpython/jit/backend/llsupport/regalloc.py
modified rpython/jit/backend/llsupport/rewrite.py
modified rpython/jit/backend/llsupport/test/test_regalloc.py
modified rpython/jit/backend/llsupport/test/test_regalloc_integration.py
modified rpython/jit/backend/model.py
modified rpython/jit/backend/ppc/regalloc.py
modified rpython/jit/backend/test/calling_convention_test.py
modified rpython/jit/backend/test/jitlog_test.py
modified rpython/jit/backend/test/runner_test.py
modified rpython/jit/backend/test/test_ll_random.py
modified rpython/jit/backend/tool/viewcode.py
modified rpython/jit/backend/x86/assembler.py
modified rpython/jit/backend/x86/callbuilder.py
modified rpython/jit/backend/x86/jump.py
modified rpython/jit/backend/x86/regalloc.py
added rpython/jit/backend/x86/reghint.py
added rpython/jit/backend/x86/test/test_regalloc.py
modified rpython/jit/backend/x86/test/test_x86vector.py
modified rpython/jit/backend/x86/vector_ext.py
modified rpython/jit/backend/zarch/regalloc.py
modified rpython/jit/codewriter/assembler.py
modified rpython/jit/codewriter/effectinfo.py
modified rpython/jit/codewriter/heaptracker.py
modified rpython/jit/codewriter/jitcode.py
modified rpython/jit/codewriter/jtransform.py
modified rpython/jit/codewriter/support.py
modified rpython/jit/codewriter/test/test_assembler.py
modified rpython/jit/codewriter/test/test_flatten.py
modified rpython/jit/codewriter/test/test_jtransform.py
modified rpython/jit/metainterp/blackhole.py
modified rpython/jit/metainterp/compile.py
modified rpython/jit/metainterp/heapcache.py
modified rpython/jit/metainterp/history.py
modified rpython/jit/metainterp/jitexc.py
modified rpython/jit/metainterp/logger.py
modified rpython/jit/metainterp/opencoder.py
modified rpython/jit/metainterp/optimizeopt/bridgeopt.py
modified rpython/jit/metainterp/optimizeopt/heap.py
modified rpython/jit/metainterp/optimizeopt/info.py
modified rpython/jit/metainterp/optimizeopt/optimizer.py
modified rpython/jit/metainterp/optimizeopt/rewrite.py
modified rpython/jit/metainterp/optimizeopt/test/test_optimizeopt.py
modified rpython/jit/metainterp/optimizeopt/test/test_unroll.py
modified rpython/jit/metainterp/optimizeopt/test/test_virtualstate.py
modified rpython/jit/metainterp/optimizeopt/virtualize.py
modified rpython/jit/metainterp/optimizeopt/virtualstate.py
modified rpython/jit/metainterp/optimizeopt/vstring.py
modified rpython/jit/metainterp/pyjitpl.py
modified rpython/jit/metainterp/quasiimmut.py
modified rpython/jit/metainterp/resume.py
added rpython/jit/metainterp/support.py
modified rpython/jit/metainterp/test/test_ajit.py
modified rpython/jit/metainterp/test/test_bridgeopt.py
modified rpython/jit/metainterp/test/test_compile.py
modified rpython/jit/metainterp/test/test_history.py
modified rpython/jit/metainterp/test/test_list.py
modified rpython/jit/metainterp/test/test_logger.py
modified rpython/jit/metainterp/test/test_quasiimmut.py
modified rpython/jit/metainterp/test/test_resume.py
modified rpython/jit/metainterp/test/test_string.py
added rpython/jit/metainterp/test/test_support.py
modified rpython/jit/metainterp/test/test_tracingopts.py
deleted rpython/jit/metainterp/test/test_typesystem.py
modified rpython/jit/metainterp/test/test_virtualizable.py
modified rpython/jit/metainterp/test/test_warmspot.py
deleted rpython/jit/metainterp/typesystem.py
modified rpython/jit/metainterp/virtualizable.py
modified rpython/jit/metainterp/virtualref.py
modified rpython/jit/metainterp/warmspot.py
modified rpython/jit/metainterp/warmstate.py
modified rpython/jit/tool/oparser_model.py
modified rpython/memory/gc/base.py
modified rpython/memory/gc/test/test_direct.py
modified rpython/rlib/_os_support.py
modified rpython/rlib/_rsocket_rffi.py
modified rpython/rlib/debug.py
added rpython/rlib/fastutf8
added rpython/rlib/fastutf8/capi.py
added rpython/rlib/fastutf8/src
added rpython/rlib/fastutf8/src/utf8-avx.c
added rpython/rlib/fastutf8/src/utf8-scalar.c
added rpython/rlib/fastutf8/src/utf8-sse4.c
added rpython/rlib/fastutf8/src/utf8.c
added rpython/rlib/fastutf8/src/utf8.h
modified rpython/rlib/jit.py
modified rpython/rlib/rarithmetic.py
modified rpython/rlib/rbigint.py
modified rpython/rlib/rdynload.py
modified rpython/rlib/rgc.py
modified rpython/rlib/rjitlog/rjitlog.py
modified rpython/rlib/rjitlog/test/test_jitlog.py
modified rpython/rlib/rpoll.py
modified rpython/rlib/rposix.py
modified rpython/rlib/rposix_stat.py
modified rpython/rlib/rsocket.py
modified rpython/rlib/rsre/rsre_core.py
modified rpython/rlib/rsre/rsre_jit.py
added rpython/rlib/rsre/rsre_utf8.py
added rpython/rlib/rsre/test/support.py
modified rpython/rlib/rsre/test/test_ext_opcode.py
modified rpython/rlib/rsre/test/test_match.py
modified rpython/rlib/rsre/test/test_search.py
modified rpython/rlib/rsre/test/test_zexternal.py
modified rpython/rlib/rstring.py
modified rpython/rlib/rstruct/nativefmttable.py
modified rpython/rlib/rstruct/unichar.py
modified rpython/rlib/runicode.py
added rpython/rlib/rutf8.py
modified rpython/rlib/rwin32.py
modified rpython/rlib/rwinreg.py
modified rpython/rlib/rzlib.py
modified rpython/rlib/signature.py
modified rpython/rlib/streamio.py
modified rpython/rlib/test/test_rawrefcount_boehm.py
modified rpython/rlib/test/test_rbigint.py
modified rpython/rlib/test/test_rsocket.py
modified rpython/rlib/test/test_rstring.py
added rpython/rlib/test/test_rutf8.py
modified rpython/rlib/test/test_rwin32.py
modified rpython/rlib/test/test_rzlib.py
modified rpython/rlib/types.py
modified rpython/rlib/unicodedata/generate_unicodedb.py
modified rpython/rlib/unicodedata/triegenerator.py
modified rpython/rlib/unicodedata/unicodedb_3_2_0.py
modified rpython/rlib/unicodedata/unicodedb_5_2_0.py
modified rpython/rlib/unicodedata/unicodedb_6_0_0.py
modified rpython/rlib/unicodedata/unicodedb_6_1_0.py
modified rpython/rlib/unicodedata/unicodedb_6_2_0.py
modified rpython/rlib/unicodedata/unicodedb_8_0_0.py
modified rpython/rlib/unicodedata/unicodedb_9_0_0.py
modified rpython/rtyper/lltypesystem/ll2ctypes.py
modified rpython/rtyper/lltypesystem/llarena.py
modified rpython/rtyper/lltypesystem/lloperation.py
modified rpython/rtyper/lltypesystem/lltype.py
modified rpython/rtyper/lltypesystem/module/test/math_cases.py
modified rpython/rtyper/lltypesystem/opimpl.py
modified rpython/rtyper/lltypesystem/rffi.py
modified rpython/rtyper/lltypesystem/test/test_rffi.py
modified rpython/rtyper/rint.py
modified rpython/rtyper/rpbc.py
modified rpython/rtyper/rstr.py
modified rpython/rtyper/test/test_rclass.py
modified rpython/tool/algo/graphlib.py
deleted rpython/tool/jitlogparser/test/test_modulefinder.py
modified rpython/tool/leakfinder.py
modified rpython/translator/backendopt/inline.py
modified rpython/translator/c/primitive.py
modified rpython/translator/c/src/int.h
modified rpython/translator/c/src/support.c
modified rpython/translator/c/src/support.h
modified rpython/translator/c/test/test_typed.py
modified rpython/translator/platform/darwin.py
modified rpython/translator/sandbox/test/test_sandlib.py
added targetunicode-bench.py
added unicode-bench.py
Committed revision 614.
Worker failed: An error (1) occurred refreshing quilt patches: None

Applying patch debian/patches/version-info
patching file pypy/module/sys/version.py
patching file rpython/tool/version.py
Refreshed patch debian/patches/version-info

Applying patch debian/patches/pep3147-core
patching file pypy/config/pypyoption.py
patching file pypy/doc/interpreter.rst
patching file pypy/interpreter/app_main.py
patching file pypy/interpreter/main.py
patching file pypy/interpreter/test/test_main.py
patching file pypy/module/imp/__init__.py
patching file pypy/module/imp/importing.py
patching file pypy/module/imp/interp_imp.py
patching file pypy/module/imp/test/test_app.py
patching file pypy/module/imp/test/test_import.py
patching file pypy/module/zipimport/test/test_undocumented.py
Refreshed patch debian/patches/pep3147-core

Applying patch debian/patches/pep3147-stdlib
patching file lib-python/2.7/compileall.py
patching file lib-python/2.7/inspect.py
patching file lib-python/2.7/py_compile.py
patching file lib-python/2.7/pydoc.py
patching file lib-python/2.7/runpy.py
patching file lib-python/2.7/site.py
patching file lib-python/2.7/test/script_helper.py
patching file lib-python/2.7/test/test_cmd_line_script.py
patching file lib-python/2.7/test/test_compileall.py
patching file lib-python/2.7/test/test_imp.py
patching file lib-python/2.7/test/test_import.py
patching file lib-python/2.7/test/test_pkg.py
patching file lib-python/2.7/test/test_pkgimport.py
patching file lib-python/2.7/test/test_py_compile.py
patching file lib-python/2.7/test/test_pydoc.py
patching file lib-python/2.7/test/test_runpy.py
patching file lib-python/2.7/test/test_site.py
patching file lib-python/2.7/test/test_support.py
patching file lib-python/2.7/test/test_traceback.py
patching file lib-python/2.7/test/test_zipfile.py
patching file lib-python/2.7/test/test_zipimport.py
patching file lib-python/2.7/zipfile.py
Refreshed patch debian/patches/pep3147-stdlib

Applying patch debian/patches/pep3147-issue11254
patching file lib-python/2.7/distutils/command/build_py.py
patching file lib-python/2.7/distutils/command/install_lib.py
patching file lib-python/2.7/distutils/tests/test_build_py.py
patching file lib-python/2.7/distutils/tests/test_install_lib.py
patching file lib-python/2.7/distutils/util.py
Refreshed patch debian/patches/pep3147-issue11254

Applying patch debian/patches/test_fsync-eatmydata
patching file lib-python/2.7/test/test_os.py
Refreshed patch debian/patches/test_fsync-eatmydata

Applying patch debian/patches/test_termios
patching file pypy/module/termios/test/test_termios.py
Refreshed patch debian/patches/test_termios

Applying patch debian/patches/fpic-archs
patching file rpython/translator/platform/__init__.py
Refreshed patch debian/patches/fpic-archs

Applying patch debian/patches/skip-test_multiprocessing
patching file lib-python/2.7/test/test_multiprocessing.py
Refreshed patch debian/patches/skip-test_multiprocessing

Applying patch debian/patches/ctypes-arm
patching file lib-python/2.7/ctypes/util.py
Refreshed patch debian/patches/ctypes-arm

Applying patch debian/patches/distutils-link
patching file lib-python/2.7/distutils/unixccompiler.py
Refreshed patch debian/patches/distutils-link

Applying patch debian/patches/locale-module
patching file lib-python/2.7/locale.py
Refreshed patch debian/patches/locale-module

Applying patch debian/patches/platform-lsbrelease
patching file lib-python/2.7/platform.py
Refreshed patch debian/patches/platform-lsbrelease

Applying patch debian/patches/xdg-gvfs-open
patching file lib-python/2.7/webbrowser.py
Refreshed patch debian/patches/xdg-gvfs-open

Applying patch debian/patches/plat-gnukfreebsd
patching file lib-python/2.7/plat-gnukfreebsd10/DLFCN.py
patching file lib-python/2.7/plat-gnukfreebsd10/IN.py
patching file lib-python/2.7/plat-gnukfreebsd10/TYPES.py
patching file lib-python/2.7/plat-gnukfreebsd11/DLFCN.py
patching file lib-python/2.7/plat-gnukfreebsd11/IN.py
patching file lib-python/2.7/plat-gnukfreebsd11/TYPES.py
patching file lib-python/2.7/plat-gnukfreebsd8/DLFCN.py
patching file lib-python/2.7/plat-gnukfreebsd8/IN.py
patching file lib-python/2.7/plat-gnukfreebsd8/TYPES.py
patching file lib-python/2.7/plat-gnukfreebsd9/DLFCN.py
patching file lib-python/2.7/plat-gnukfreebsd9/IN.py
patching file lib-python/2.7/plat-gnukfreebsd9/TYPES.py
Refreshed patch debian/patches/plat-gnukfreebsd

Applying patch debian/patches/plat-linux2-differences
patching file lib-python/2.7/plat-linux2/DLFCN.py
patching file lib-python/2.7/plat-linux2/DLFCN_default.py
patching file lib-python/2.7/plat-linux2/DLFCN_mips.py
patching file lib-python/2.7/plat-linux2/IN.py
patching file lib-python/2.7/plat-linux2/IN_alpha.py
patching file lib-python/2.7/plat-linux2/IN_default.py
patching file lib-python/2.7/plat-linux2/IN_hppa.py
patching file lib-python/2.7/plat-linux2/IN_mips.py
patching file lib-python/2.7/plat-linux2/IN_sparc.py
Refreshed patch debian/patches/plat-linux2-differences

Applying patch debian/patches/ensurepip-wheels
patching file lib-python/2.7/ensurepip/__init__.py
Refreshed patch debian/patches/ensurepip-wheels

Applying patch debian/patches/ensurepip-disabled
patching file lib-python/2.7/ensurepip/__init__.py
patching file lib-python/2.7/test/test_ensurepip.py
Refreshed patch debian/patches/ensurepip-disabled

Applying patch debian/patches/multiarch
patching file lib-python/2.7/sysconfig.py
patching file lib-python/2.7/test/test_sysconfig.py
patching file lib_pypy/_sysconfigdata.py
patching file pypy/module/imp/importing.py
patching file pypy/module/imp/interp_imp.py
patching file pypy/module/imp/test/test_import.py
patching file pypy/module/sys/__init__.py
patching file pypy/module/sys/debian.py
patching file pypy/module/sys/test/test_sysmodule.py
Refreshed patch debian/patches/multiarch

Applying patch debian/patches/distutils-install-layout
patching file lib-python/2.7/distutils/command/install.py
patching file lib-python/2.7/distutils/command/install_egg_info.py
patching file lib-python/2.7/distutils/sysconfig_pypy.py
patching file lib-python/2.7/pydoc.py
patching file lib-python/2.7/site.py
patching file lib-python/2.7/sysconfig.py
patching file lib-python/2.7/test/test_site.py
patching file lib-python/2.7/test/test_sysconfig.py
Refreshed patch debian/patches/distutils-install-layout

Applying patch debian/patches/langpack-gettext
patching file lib-python/2.7/gettext.py
Refreshed patch debian/patches/langpack-gettext

Applying patch debian/patches/tkinter-import
patching file lib-python/2.7/lib-tk/Tkinter.py
Refreshed patch debian/patches/tkinter-import

Applying patch debian/patches/noise
patching file rpython/tool/ansi_print.py
Refreshed patch debian/patches/noise

Applying patch debian/patches/skip-hurd-deadlock
patching file pypy/module/thread/test/test_lock.py
Refreshed patch debian/patches/skip-hurd-deadlock

Applying patch debian/patches/graphlib-dots
patching file rpython/tool/algo/graphlib.py
Hunk #1 FAILED at 6.
Hunk #2 FAILED at 292.
2 out of 2 hunks FAILED -- rejects in file rpython/tool/algo/graphlib.py
Patch debian/patches/graphlib-dots does not apply (enforce with -f)

Elapsed time: 0:02:43.980174

Full worker log