Run of lintian-fixes for python-apptools

Try this locally (using the lintian-brush package):

debcheckout python-apptools
cd python-apptools
lintian-brush
3364
3365
3366
3367
3368
3369
3370
3371
3372
3373
3374
3375
3376
3377
3378
test_undo_redo_1_command (apptools.undo.tests.test_command_stack.TestCommandStack) ... ok
test_undo_unnamed_command (apptools.undo.tests.test_command_stack.TestCommandStack) ... ok

----------------------------------------------------------------------
Ran 401 tests in 3.138s

OK (SKIP=1)
dh_auto_test: error: pybuild --test --test-nose -i python{version} -p "3.9 3.8" returned exit code 13
make[1]: *** [debian/rules:15: override_dh_auto_test] Error 25
make[1]: Leaving directory '/<<PKGBUILDDIR>>'
make: *** [debian/rules:7: build] Error 2
dpkg-buildpackage: error: debian/rules build subprocess returned exit status 2
--------------------------------------------------------------------------------
Build finished at 2020-11-11T15:42:22Z

Summary

Full worker log Full build log