Run of fresh-snapshots for python-bleach

Try this locally (using silver-platter):

debian-svp new-upstream --snapshot python-bleach 
16
17
18
19
20
21
22
23
24
25
26
27
1 out of 1 hunk FAILED
patching file tests_website/index.html
Hunk #1 FAILED at 21.
1 out of 1 hunk FAILED
dpkg-source: info: the patch has fuzz which is not allowed, or is malformed
dpkg-source: info: if patch '0001-remove-privacy-breach.patch' is correctly applied by quilt, use 'quilt refresh' to update it
dpkg-source: error: LC_ALL=C patch -t -F 0 -N -p1 -u -V never -E -b -B .pc/0001-remove-privacy-breach.patch/ --reject-file=- < python-bleach-3.3.0+git20210222.1.3e5d6aa.orig.hGQ9or/debian/patches/0001-remove-privacy-breach.patch subprocess returned exit status 1
dpkg-source: info: using options from python-bleach-3.3.0+git20210222.1.3e5d6aa/debian/source/options: --extend-diff-ignore=^[^/]+\.egg-info/
E: Failed to open build log /tmp/tmpdu50lx29/build-area//tmp/tmpdu50lx29/build-area/python-bleach_3.3.0+git20210222.1.3e5d6aa-1~jan+nus1.dsc_amd64-2021-04-05T01:41:30Z.build: No such file or directory
print() on closed filehandle $PLOG at /usr/share/perl5/Sbuild/Base.pm line 90.
E: unable to mktemp
brz: ERROR: The build failed.

Summary

Merged new upstream version: 3.3.0+git20210222.1.3e5d6aa (was: 3.2.1).

Full worker log Full build log Full dist log