Run of fresh-snapshots for python-django-debug-toolbar

Try this locally (using silver-platter):

debian-svp new-upstream --snapshot python-django-debug-toolbar 
943
944
945
946
947
948
949
950
951
952
953
954
955
956
957
copying debug_toolbar/templates/debug_toolbar/panels/template_source.html -> /<<PKGBUILDDIR>>/.pybuild/cpython3_3.9_django-debug-toolbar/build/debug_toolbar/templates/debug_toolbar/panels
copying debug_toolbar/templates/debug_toolbar/panels/templates.html -> /<<PKGBUILDDIR>>/.pybuild/cpython3_3.9_django-debug-toolbar/build/debug_toolbar/templates/debug_toolbar/panels
copying debug_toolbar/templates/debug_toolbar/panels/timer.html -> /<<PKGBUILDDIR>>/.pybuild/cpython3_3.9_django-debug-toolbar/build/debug_toolbar/templates/debug_toolbar/panels
copying debug_toolbar/templates/debug_toolbar/panels/versions.html -> /<<PKGBUILDDIR>>/.pybuild/cpython3_3.9_django-debug-toolbar/build/debug_toolbar/templates/debug_toolbar/panels
PYTHONPATH=. http_proxy='127.0.0.1:9' python3 -m sphinx -N -bhtml docs/ build/html

Application error:
config directory doesn't contain a conf.py file (docs/)
make[1]: *** [debian/rules:21: override_dh_auto_build] Error 2
make[1]: Leaving directory '/<<PKGBUILDDIR>>'
make: *** [debian/rules:10: build] Error 2
dpkg-buildpackage: error: debian/rules build subprocess returned exit status 2
--------------------------------------------------------------------------------
Build finished at 2021-04-08T18:07:56Z

Summary

Merged new upstream version: 3.2a1+git20210309.1.8b280e1 (was: 2.0).

Full worker log Full build log Full dist log