Run of fresh-snapshots for python-exchangelib

Try this locally (using the package):

debcheckout python-exchangelib
cd python-exchangelib
new-upstream --snapshot --refresh-patches
866
867
868
869
870
871
872
873
874
875
876
877
878
879
880
copying exchangelib/services/expand_dl.py -> /<<PKGBUILDDIR>>/.pybuild/cpython3_3.9_exchangelib/build/exchangelib/services
   dh_auto_test -O--buildsystem=pybuild
I: pybuild base:232: python3.9 setup.py test 
running test
WARNING: Testing via this command is deprecated and will be removed in a future version. Users looking for a generic test entry point independent of test runner are encouraged to use tox.
WARNING: The wheel package is not available.
/usr/bin/python3.9: No module named pip
error: Command '['/usr/bin/python3.9', '-m', 'pip', '--disable-pip-version-check', 'wheel', '--no-deps', '-w', '/tmp/tmpklh9dgev', '--quiet', 'tzdata']' returned non-zero exit status 1.
E: pybuild pybuild:353: test: plugin distutils failed with: exit code=1: python3.9 setup.py test 
dh_auto_test: error: pybuild --test -i python{version} -p 3.9 returned exit code 13
make: *** [debian/rules:9: binary] Error 25
dpkg-buildpackage: error: debian/rules binary subprocess returned exit status 2
--------------------------------------------------------------------------------
Build finished at 2021-06-03T04:13:18Z

Summary

Merged new upstream version: 4.4.0+git20210601.1.a239494 (was: 3.2.0).

Full worker log Full build log Full dist log