Run of fresh-snapshots for python-fakeredis

Try this locally (using silver-platter):

debian-svp new-upstream --snapshot python-fakeredis 
13005
13006
13007
13008
13009
13010
13011
13012
13013
13014
13015
13016
13017
13018
13019
ERROR test/test_fakeredis.py::TestFakeStrictRedisConnectionErrors::test_hscan[FakeStrictRedis]
ERROR test/test_fakeredis.py::TestFakeStrictRedisConnectionErrors::test_scan_iter[FakeStrictRedis]
ERROR test/test_fakeredis.py::TestFakeStrictRedisConnectionErrors::test_sscan_iter[FakeStrictRedis]
ERROR test/test_fakeredis.py::TestFakeStrictRedisConnectionErrors::test_hscan_iter[FakeStrictRedis]
ERROR test/test_fakeredis.py::TestPubSubConnected::test_basic_subscribe[FakeStrictRedis]
ERROR test/test_fakeredis.py::TestPubSubConnected::test_subscription_conn_lost[FakeStrictRedis]
================= 7 passed, 591 skipped, 599 errors in 54.59s ==================
E: pybuild pybuild:353: test: plugin distutils failed with: exit code=1: cd /<<PKGBUILDDIR>>/.pybuild/cpython3_3.9_fakeredis/build; python3.9 -m pytest --ignore=test/test_aioredis.py
dh_auto_test: error: pybuild --test --test-pytest -i python{version} -p 3.9 returned exit code 13
make: *** [debian/rules:8: binary] Error 25
dpkg-buildpackage: error: debian/rules binary subprocess returned exit status 2
--------------------------------------------------------------------------------
Build finished at 2021-04-05T09:04:56Z

Finished

Summary

Merged new upstream version: 1.5.0 (was: 1.4.5).

Full worker log Full build log Full dist log