Run of fresh-releases for python-flake8

Try this locally (using silver-platter):

debian-svp new-upstream python-flake8 
1
2
3
4
5
6
7
8
9
10
11
12
13
14
15
16
17
18
19
20
21
22
23
24
25
26
27
28
29
30
31
32
33
34
35
36
37
38
39
40
41
42
43
44
45
46
47
48
49
50
51
52
53
54
55
56
57
58
59
60
61
62
63
64
65
66
67
68
69
70
71
72
73
74
75
76
77
78
79
80
81
82
83
84
85
86
87
88
89
90
91
92
93
94
95
96
97
98
99
100
101
102
103
104
105
106
107
108
109
110
111
112
113
114
115
116
117
118
119
120
121
122
123
124
125
126
127
128
129
130
131
132
133
134
135
136
137
138
139
140
141
142
143
144
145
146
147
148
149
150
151
152
153
154
155
156
157
158
159
160
161
162
163
164
165
166
167
168
169
170
171
172
173
174
175
176
177
178
179
180
181
182
183
184
185
186
187
188
189
190
191
192
193
194
195
196
197
198
199
200
201
202
203
204
205
206
207
208
209
210
211
212
213
214
215
216
217
218
219
220
221
222
223
224
225
226
227
228
229
230
231
232
233
234
235
236
237
238
239
240
241
242
243
244
245
246
247
248
249
250
251
252
253
254
255
256
257
258
259
260
261
262
263
264
265
266
267
268
269
270
271
272
273
274
275
276
277
278
279
280
281
282
283
284
285
286
287
288
289
290
291
292
293
294
295
296
297
298
299
300
301
302
303
304
305
306
307
308
309
310
311
312
313
314
315
316
317
318
319
320
321
322
323
324
325
326
327
328
329
330
331
332
333
334
335
336
337
338
339
340
341
342
Processing: python-flake8
git: refs/tags/debian/3.4.1-2 does not point to a valid object!
git: refs/tags/debian/3.5.0-2 does not point to a valid object!
git: refs/tags/debian/3.6.0-1 does not point to a valid object!
git: refs/tags/upstream/2.0 does not point to a valid object!
git: refs/tags/upstream/2.1.0 does not point to a valid object!
git: refs/tags/upstream/2.2.2 does not point to a valid object!
Total 8500 (delta 0), reused 8500 (delta 0)

Using upstream branch https://gitlab.com/pycqa/flake8.git (from configuration)
warning: ignoring extra bitmap file: /var/opt/gitlab/git-data/repositories/@pools/8d/fd/8dfd13f4376053626e97eb7221d469013cae9bc0
31027e64f0db2ec114f8ffd9.git/objects/pack/pack-d5cdd75d6d43c3a18441852b5b8382976c41d1a7.pack
Total 768 (delta 422), reused 623 (delta 321)
Using version string 3.7.7.
No upstream upstream-revision format specified, trying tag:3.7.7
Using uscan to look for the upstream tarball.
warning: ignoring extra bitmap file: /var/opt/gitlab/git-data/repositories/@pools/8d/fd/8dfd13f4376053626e97eb7221d469013cae9bc0
31027e64f0db2ec114f8ffd9.git/objects/pack/pack-d5cdd75d6d43c3a18441852b5b8382976c41d1a7.pack

638)   
Total 638 (delta 358), reused 553 (delta 294)
2.6.2 does not point to a valid object
/usr/lib/python3/dist-packages/dulwich/repo.py:393: UserWarning: ref refs/tags/3.6.0 points at non-present sha dbffe6e70559535f57294fcfec8707167a176b74
  UserWarning)
/usr/lib/python3/dist-packages/dulwich/repo.py:393: UserWarning: ref refs/tags/3.0.3 points at non-present sha 4c7ee19b1a2958c3f25ae442d90d6e5fef8628ba
  UserWarning)
/usr/lib/python3/dist-packages/dulwich/repo.py:393: UserWarning: ref refs/tags/3.7.0 points at non-present sha 76d4cc89430ec9095db4923524fb6a6f0bed012f
  UserWarning)
/usr/lib/python3/dist-packages/dulwich/repo.py:393: UserWarning: ref refs/tags/3.4.1 points at non-present sha 3f51c6cc67130d57c17203945af963d37e4bf75a
  UserWarning)
/usr/lib/python3/dist-packages/dulwich/repo.py:393: UserWarning: ref refs/tags/2.2.4 points at non-present sha 18f9405bdede3cb9f162ff6cf613aa0d11574820
  UserWarning)
/usr/lib/python3/dist-packages/dulwich/repo.py:393: UserWarning: ref refs/tags/3.0.0b2 points at non-present sha 622591b8b7ef3c7cb0039e57b1f4b20c058361d3
  UserWarning)
/usr/lib/python3/dist-packages/dulwich/repo.py:393: UserWarning: ref refs/tags/2.4.0 points at non-present sha 7f253114bbe03ff4b98b68076d4401cb17ac1269
  UserWarning)
/usr/lib/python3/dist-packages/dulwich/repo.py:393: UserWarning: ref refs/tags/3.2.0 points at non-present sha 5b43c9ea6639c91311c55f6b22340650d4ec8075
  UserWarning)
/usr/lib/python3/dist-packages/dulwich/repo.py:393: UserWarning: ref refs/tags/2.4.1 points at non-present sha 1cfaa028f9862b05565cba65f1928e17ac668f29
  UserWarning)
/usr/lib/python3/dist-packages/dulwich/repo.py:393: UserWarning: ref refs/tags/3.1.1 points at non-present sha 88e419c08f597ec5088f7025aa12edae2a34c9bd
  UserWarning)
/usr/lib/python3/dist-packages/dulwich/repo.py:393: UserWarning: ref refs/tags/2.5.3 points at non-present sha 9b5decc59b199cda0967e2d6e798446ec8335f3a
  UserWarning)
/usr/lib/python3/dist-packages/dulwich/repo.py:393: UserWarning: ref refs/tags/3.7.6 points at non-present sha 0e3c8d6800323307256bbeee561603508479c6b9
  UserWarning)
/usr/lib/python3/dist-packages/dulwich/repo.py:393: UserWarning: ref refs/tags/3.0.0b1 points at non-present sha 2745bf333d12dbe47f992eb048272d8f0a949759
  UserWarning)
/usr/lib/python3/dist-packages/dulwich/repo.py:393: UserWarning: ref refs/tags/3.7.4 points at non-present sha 0f7166f3d1bc1b7ed3ac46e36e3d1cbcf5ca6b7a
  UserWarning)
/usr/lib/python3/dist-packages/dulwich/repo.py:393: UserWarning: ref refs/tags/3.0.2 points at non-present sha 4dced78341b18d581c4a8df6995da8482fc2c9d6
  UserWarning)
/usr/lib/python3/dist-packages/dulwich/repo.py:393: UserWarning: ref refs/tags/3.7.2 points at non-present sha 4842a08f09e0604359fe5e944c216ccef31dbfeb
  UserWarning)
/usr/lib/python3/dist-packages/dulwich/repo.py:393: UserWarning: ref refs/tags/3.3.0 points at non-present sha f8b28bb314ae5dfd6e87a2a0653e280c8e744414
  UserWarning)
/usr/lib/python3/dist-packages/dulwich/repo.py:393: UserWarning: ref refs/tags/3.4.0 points at non-present sha bd0147f1cd4d62ee900995d4d6010ef3a22fcb9c
  UserWarning)
/usr/lib/python3/dist-packages/dulwich/repo.py:393: UserWarning: ref refs/tags/3.7.1 points at non-present sha ddd61d19b0ac4a3e00b40243c41d4a55759e2163
  UserWarning)
/usr/lib/python3/dist-packages/dulwich/repo.py:393: UserWarning: ref refs/tags/2.5.1 points at non-present sha 9225ef7132e155039bd088ae13dcc4c5c1abb5f9
  UserWarning)
/usr/lib/python3/dist-packages/dulwich/repo.py:393: UserWarning: ref refs/tags/2.5.5 points at non-present sha a1f5927f49c7254c472e5fd4ddf30aa922511c3e
  UserWarning)
/usr/lib/python3/dist-packages/dulwich/repo.py:393: UserWarning: ref refs/tags/2.5.2 points at non-present sha 299b7191f6e6a03e91c07c2983496b0ff8d31ec1
  UserWarning)
/usr/lib/python3/dist-packages/dulwich/repo.py:393: UserWarning: ref refs/tags/2.5.0 points at non-present sha 1529ef1894ef09457e744ae16056c0f685cd7254
  UserWarning)
/usr/lib/python3/dist-packages/dulwich/repo.py:393: UserWarning: ref refs/tags/3.0.1 points at non-present sha 1ae5c6456280e7e4a5254e552fa7bd051eb3bd8d
  UserWarning)
/usr/lib/python3/dist-packages/dulwich/repo.py:393: UserWarning: ref refs/tags/3.7.5 points at non-present sha ae395ee2ca5420bba5518c20a41193c2145410a3
  UserWarning)
/usr/lib/python3/dist-packages/dulwich/repo.py:393: UserWarning: ref refs/tags/3.5.0 points at non-present sha 92bc12af051df59c534a31be7b6a9558723db546
  UserWarning)
/usr/lib/python3/dist-packages/dulwich/repo.py:393: UserWarning: ref refs/tags/3.1.0b2 points at non-present sha 711743381b5f244ec01344dad9853c3b52f8e0e2
  UserWarning)
/usr/lib/python3/dist-packages/dulwich/repo.py:393: UserWarning: ref refs/tags/2.5.4 points at non-present sha 852211528aa613edbe3ff33887965002987f4acb
  UserWarning)
/usr/lib/python3/dist-packages/dulwich/repo.py:393: UserWarning: ref refs/tags/2.6.1 points at non-present sha af8c511c1fb5f665f2d29f2fc8b73edcdece2437
  UserWarning)
/usr/lib/python3/dist-packages/dulwich/repo.py:393: UserWarning: ref refs/tags/3.1.0 points at non-present sha 1d7d88a3ca125bc623ff49c9e716a3166100390c
  UserWarning)
/usr/lib/python3/dist-packages/dulwich/repo.py:393: UserWarning: ref refs/tags/2.3.0 points at non-present sha 04a9e5c1d1846de22521e7c059aed49451fb2139
  UserWarning)
/usr/lib/python3/dist-packages/dulwich/repo.py:393: UserWarning: ref refs/tags/3.0.0 points at non-present sha 0d15bfc6d8f74099bdd4b01a6f80db5bf820e66f
  UserWarning)
/usr/lib/python3/dist-packages/dulwich/repo.py:393: UserWarning: ref refs/tags/3.2.1 points at non-present sha 9ab69baea825dbecacef7dba6597ade1075e17dd
  UserWarning)
/usr/lib/python3/dist-packages/dulwich/repo.py:393: UserWarning: ref refs/tags/3.1.0b1 points at non-present sha 0b86f3acf28bb563bb351d50ce2209ac559b7a86
  UserWarning)
/usr/lib/python3/dist-packages/dulwich/repo.py:393: UserWarning: ref refs/tags/3.7.3 points at non-present sha 366e9978b78b593c5e97dcdf6bd7ad1d1ac2b543
  UserWarning)
/usr/lib/python3/dist-packages/dulwich/repo.py:393: UserWarning: ref refs/tags/3.0.4 points at non-present sha c8f01a1418a69ee91e472eff693655fb7c4f7614
  UserWarning)
/usr/lib/python3/dist-packages/dulwich/repo.py:393: UserWarning: ref refs/tags/2.2.5 points at non-present sha 598b2556f27d1ba86d5445f19becaa17d1abe08b
  UserWarning)
/usr/lib/python3/dist-packages/dulwich/repo.py:393: UserWarning: ref refs/tags/2.6.0 points at non-present sha 62942cdd6ce26feebeaecfb5deea144a1772e7c1
  UserWarning)
Not storing pristine-tar metadata, since there is no pristine-tar branch.
/usr/lib/python3/dist-packages/dulwich/repo.py:393: UserWarning: ref refs/tags/3.6.0 points at non-present sha dbffe6e70559535f57294fcfec8707167a176b74
  UserWarning)
/usr/lib/python3/dist-packages/dulwich/repo.py:393: UserWarning: ref refs/tags/3.0.3 points at non-present sha 4c7ee19b1a2958c3f25ae442d90d6e5fef8628ba
  UserWarning)
/usr/lib/python3/dist-packages/dulwich/repo.py:393: UserWarning: ref refs/tags/3.7.0 points at non-present sha 76d4cc89430ec9095db4923524fb6a6f0bed012f
  UserWarning)
/usr/lib/python3/dist-packages/dulwich/repo.py:393: UserWarning: ref refs/tags/3.4.1 points at non-present sha 3f51c6cc67130d57c17203945af963d37e4bf75a
  UserWarning)
/usr/lib/python3/dist-packages/dulwich/repo.py:393: UserWarning: ref refs/tags/2.2.4 points at non-present sha 18f9405bdede3cb9f162ff6cf613aa0d11574820
  UserWarning)
/usr/lib/python3/dist-packages/dulwich/repo.py:393: UserWarning: ref refs/tags/3.0.0b2 points at non-present sha 622591b8b7ef3c7cb0039e57b1f4b20c058361d3
  UserWarning)
/usr/lib/python3/dist-packages/dulwich/repo.py:393: UserWarning: ref refs/tags/2.4.0 points at non-present sha 7f253114bbe03ff4b98b68076d4401cb17ac1269
  UserWarning)
/usr/lib/python3/dist-packages/dulwich/repo.py:393: UserWarning: ref refs/tags/3.2.0 points at non-present sha 5b43c9ea6639c91311c55f6b22340650d4ec8075
  UserWarning)
/usr/lib/python3/dist-packages/dulwich/repo.py:393: UserWarning: ref refs/tags/2.4.1 points at non-present sha 1cfaa028f9862b05565cba65f1928e17ac668f29
  UserWarning)
/usr/lib/python3/dist-packages/dulwich/repo.py:393: UserWarning: ref refs/tags/3.1.1 points at non-present sha 88e419c08f597ec5088f7025aa12edae2a34c9bd
  UserWarning)
/usr/lib/python3/dist-packages/dulwich/repo.py:393: UserWarning: ref refs/tags/2.5.3 points at non-present sha 9b5decc59b199cda0967e2d6e798446ec8335f3a
  UserWarning)
/usr/lib/python3/dist-packages/dulwich/repo.py:393: UserWarning: ref refs/tags/3.7.6 points at non-present sha 0e3c8d6800323307256bbeee561603508479c6b9
  UserWarning)
/usr/lib/python3/dist-packages/dulwich/repo.py:393: UserWarning: ref refs/tags/3.0.0b1 points at non-present sha 2745bf333d12dbe47f992eb048272d8f0a949759
  UserWarning)
/usr/lib/python3/dist-packages/dulwich/repo.py:393: UserWarning: ref refs/tags/3.7.4 points at non-present sha 0f7166f3d1bc1b7ed3ac46e36e3d1cbcf5ca6b7a
  UserWarning)
/usr/lib/python3/dist-packages/dulwich/repo.py:393: UserWarning: ref refs/tags/3.0.2 points at non-present sha 4dced78341b18d581c4a8df6995da8482fc2c9d6
  UserWarning)
/usr/lib/python3/dist-packages/dulwich/repo.py:393: UserWarning: ref refs/tags/3.7.2 points at non-present sha 4842a08f09e0604359fe5e944c216ccef31dbfeb
  UserWarning)
/usr/lib/python3/dist-packages/dulwich/repo.py:393: UserWarning: ref refs/tags/3.3.0 points at non-present sha f8b28bb314ae5dfd6e87a2a0653e280c8e744414
  UserWarning)
/usr/lib/python3/dist-packages/dulwich/repo.py:393: UserWarning: ref refs/tags/3.4.0 points at non-present sha bd0147f1cd4d62ee900995d4d6010ef3a22fcb9c
  UserWarning)
/usr/lib/python3/dist-packages/dulwich/repo.py:393: UserWarning: ref refs/tags/3.7.1 points at non-present sha ddd61d19b0ac4a3e00b40243c41d4a55759e2163
  UserWarning)
/usr/lib/python3/dist-packages/dulwich/repo.py:393: UserWarning: ref refs/tags/2.5.1 points at non-present sha 9225ef7132e155039bd088ae13dcc4c5c1abb5f9
  UserWarning)
/usr/lib/python3/dist-packages/dulwich/repo.py:393: UserWarning: ref refs/tags/2.5.5 points at non-present sha a1f5927f49c7254c472e5fd4ddf30aa922511c3e
  UserWarning)
/usr/lib/python3/dist-packages/dulwich/repo.py:393: UserWarning: ref refs/tags/2.5.2 points at non-present sha 299b7191f6e6a03e91c07c2983496b0ff8d31ec1
  UserWarning)
/usr/lib/python3/dist-packages/dulwich/repo.py:393: UserWarning: ref refs/tags/2.5.0 points at non-present sha 1529ef1894ef09457e744ae16056c0f685cd7254
  UserWarning)
/usr/lib/python3/dist-packages/dulwich/repo.py:393: UserWarning: ref refs/tags/3.0.1 points at non-present sha 1ae5c6456280e7e4a5254e552fa7bd051eb3bd8d
  UserWarning)
/usr/lib/python3/dist-packages/dulwich/repo.py:393: UserWarning: ref refs/tags/3.7.5 points at non-present sha ae395ee2ca5420bba5518c20a41193c2145410a3
  UserWarning)
/usr/lib/python3/dist-packages/dulwich/repo.py:393: UserWarning: ref refs/tags/3.5.0 points at non-present sha 92bc12af051df59c534a31be7b6a9558723db546
  UserWarning)
/usr/lib/python3/dist-packages/dulwich/repo.py:393: UserWarning: ref refs/tags/3.1.0b2 points at non-present sha 711743381b5f244ec01344dad9853c3b52f8e0e2
  UserWarning)
/usr/lib/python3/dist-packages/dulwich/repo.py:393: UserWarning: ref refs/tags/2.5.4 points at non-present sha 852211528aa613edbe3ff33887965002987f4acb
  UserWarning)
/usr/lib/python3/dist-packages/dulwich/repo.py:393: UserWarning: ref refs/tags/2.6.1 points at non-present sha af8c511c1fb5f665f2d29f2fc8b73edcdece2437
  UserWarning)
/usr/lib/python3/dist-packages/dulwich/repo.py:393: UserWarning: ref refs/tags/3.1.0 points at non-present sha 1d7d88a3ca125bc623ff49c9e716a3166100390c
  UserWarning)
/usr/lib/python3/dist-packages/dulwich/repo.py:393: UserWarning: ref refs/tags/2.3.0 points at non-present sha 04a9e5c1d1846de22521e7c059aed49451fb2139
  UserWarning)
/usr/lib/python3/dist-packages/dulwich/repo.py:393: UserWarning: ref refs/tags/3.0.0 points at non-present sha 0d15bfc6d8f74099bdd4b01a6f80db5bf820e66f
  UserWarning)
/usr/lib/python3/dist-packages/dulwich/repo.py:393: UserWarning: ref refs/tags/3.2.1 points at non-present sha 9ab69baea825dbecacef7dba6597ade1075e17dd
  UserWarning)
/usr/lib/python3/dist-packages/dulwich/repo.py:393: UserWarning: ref refs/tags/3.1.0b1 points at non-present sha 0b86f3acf28bb563bb351d50ce2209ac559b7a86
  UserWarning)
/usr/lib/python3/dist-packages/dulwich/repo.py:393: UserWarning: ref refs/tags/3.7.3 points at non-present sha 366e9978b78b593c5e97dcdf6bd7ad1d1ac2b543
  UserWarning)
/usr/lib/python3/dist-packages/dulwich/repo.py:393: UserWarning: ref refs/tags/3.0.4 points at non-present sha c8f01a1418a69ee91e472eff693655fb7c4f7614
  UserWarning)
/usr/lib/python3/dist-packages/dulwich/repo.py:393: UserWarning: ref refs/tags/2.2.5 points at non-present sha 598b2556f27d1ba86d5445f19becaa17d1abe08b
  UserWarning)
/usr/lib/python3/dist-packages/dulwich/repo.py:393: UserWarning: ref refs/tags/2.6.0 points at non-present sha 62942cdd6ce26feebeaecfb5deea144a1772e7c1
  UserWarning)
3.6.0 does not point to a valid object
3.0.3 does not point to a valid object
3.7.0 does not point to a valid object
3.4.1 does not point to a valid object
2.2.4 does not point to a valid object
3.0.0b2 does not point to a valid object
2.4.0 does not point to a valid object
3.2.0 does not point to a valid object
2.4.1 does not point to a valid object
3.1.1 does not point to a valid object
2.5.3 does not point to a valid object
3.7.6 does not point to a valid object
3.0.0b1 does not point to a valid object
3.7.4 does not point to a valid object
3.0.2 does not point to a valid object
3.7.2 does not point to a valid object
3.3.0 does not point to a valid object
3.4.0 does not point to a valid object
3.7.1 does not point to a valid object
2.5.1 does not point to a valid object
2.5.5 does not point to a valid object
2.5.2 does not point to a valid object
2.5.0 does not point to a valid object
3.0.1 does not point to a valid object
3.7.5 does not point to a valid object
3.5.0 does not point to a valid object
3.1.0b2 does not point to a valid object
2.5.4 does not point to a valid object
2.6.1 does not point to a valid object
3.1.0 does not point to a valid object
3.7.7 does not point to a valid object
2.3.0 does not point to a valid object
3.0.0 does not point to a valid object
3.2.1 does not point to a valid object
3.1.0b1 does not point to a valid object
3.7.3 does not point to a valid object
3.0.4 does not point to a valid object
2.2.5 does not point to a valid object
2.6.0 does not point to a valid object
All changes applied successfully.
3.6.0 does not point to a valid object
3.0.3 does not point to a valid object
3.7.0 does not point to a valid object
3.4.1 does not point to a valid object
2.2.4 does not point to a valid object
3.0.0b2 does not point to a valid object
2.4.0 does not point to a valid object
3.2.0 does not point to a valid object
2.4.1 does not point to a valid object
3.1.1 does not point to a valid object
2.5.3 does not point to a valid object
3.7.6 does not point to a valid object
3.0.0b1 does not point to a valid object
3.7.4 does not point to a valid object
3.0.2 does not point to a valid object
3.7.2 does not point to a valid object
3.3.0 does not point to a valid object
3.4.0 does not point to a valid object
3.7.1 does not point to a valid object
2.5.1 does not point to a valid object
2.5.5 does not point to a valid object
2.5.2 does not point to a valid object
2.5.0 does not point to a valid object
3.0.1 does not point to a valid object
3.7.5 does not point to a valid object
3.5.0 does not point to a valid object
3.1.0b2 does not point to a valid object
2.5.4 does not point to a valid object
2.6.1 does not point to a valid object
3.1.0 does not point to a valid object
3.7.7 does not point to a valid object
2.3.0 does not point to a valid object
3.0.0 does not point to a valid object
3.2.1 does not point to a valid object
3.1.0b1 does not point to a valid object
3.7.3 does not point to a valid object
3.0.4 does not point to a valid object
2.2.5 does not point to a valid object
2.6.0 does not point to a valid object
Committing to: /home/janitor/tmp/tmpmqt1o593/python-flake8/
modified PKG-INFO
modified README.rst
modified debian/changelog
modified docs/source/internal/checker.rst
modified docs/source/internal/plugin_handling.rst
modified docs/source/internal/utils.rst
modified docs/source/plugin-development/cross-compatibility.rst
modified docs/source/plugin-development/plugin-parameters.rst
modified docs/source/plugin-development/registering-plugins.rst
modified docs/source/release-notes/3.6.0.rst
added docs/source/release-notes/3.7.0.rst
added docs/source/release-notes/3.7.1.rst
added docs/source/release-notes/3.7.2.rst
added docs/source/release-notes/3.7.3.rst
added docs/source/release-notes/3.7.4.rst
added docs/source/release-notes/3.7.5.rst
added docs/source/release-notes/3.7.6.rst
added docs/source/release-notes/3.7.7.rst
modified docs/source/release-notes/index.rst
modified docs/source/user/error-codes.rst
modified docs/source/user/options.rst
modified docs/source/user/python-api.rst
modified docs/source/user/using-hooks.rst
modified docs/source/user/violations.rst
added mypy.ini
modified pytest.ini
modified setup.cfg
modified setup.py
modified src/flake8/__init__.py
modified src/flake8/api/legacy.py
modified src/flake8/checker.py
modified src/flake8/defaults.py
modified src/flake8/exceptions.py
modified src/flake8/main/application.py
modified src/flake8/main/cli.py
modified src/flake8/main/debug.py
modified src/flake8/main/options.py
modified src/flake8/main/setuptools_command.py
modified src/flake8/options/config.py
modified src/flake8/options/manager.py
deleted src/flake8/plugins/_trie.py
modified src/flake8/plugins/manager.py
deleted src/flake8/plugins/notifier.py
modified src/flake8/plugins/pyflakes.py
modified src/flake8/processor.py
modified src/flake8/style_guide.py
modified src/flake8/utils.py
modified src/flake8.egg-info/PKG-INFO
modified src/flake8.egg-info/SOURCES.txt
modified src/flake8.egg-info/entry_points.txt
modified src/flake8.egg-info/requires.txt
added tests/integration/test_api_legacy.py
modified tests/integration/test_checker.py
added tests/integration/test_main.py
added tests/unit/conftest.py
modified tests/unit/test_application.py
modified tests/unit/test_base_formatter.py
modified tests/unit/test_checker_manager.py
modified tests/unit/test_debug.py
added tests/unit/test_exceptions.py
modified tests/unit/test_file_checker.py
modified tests/unit/test_file_processor.py
modified tests/unit/test_legacy_api.py
deleted tests/unit/test_notifier.py
modified tests/unit/test_option.py
modified tests/unit/test_plugin.py
modified tests/unit/test_plugin_manager.py
modified tests/unit/test_plugin_type_manager.py
modified tests/unit/test_pyflakes_codes.py
modified tests/unit/test_style_guide.py
deleted tests/unit/test_trie.py
modified tests/unit/test_utils.py
modified tests/unit/test_violation.py
modified tox.ini
Committed revision 133.
Worker failed: An error (1) occurred refreshing quilt patches: None

Applying patch debian/patches/0001-Remove-upper-constrains-from-upstream-requirements.patch
patching file setup.cfg
Hunk #1 FAILED at 9.
1 out of 1 hunk FAILED -- rejects in file setup.cfg
patching file setup.py
Hunk #1 FAILED at 21.
1 out of 1 hunk FAILED -- rejects in file setup.py
Patch debian/patches/0001-Remove-upper-constrains-from-upstream-requirements.patch does not apply (enforce with -f)

Elapsed time: 0:00:51.129321

Full worker log