Run of lintian-fixes for python-gflags

Try this locally (using the lintian-brush package):

debcheckout python-gflags
cd python-gflags
lintian-brush
1
2
3
4
5
6
7
8
9
10
11
12
13
14
15
16
17
18
19
20
21
22
23
24
25
Processing: python-gflags
git: refs/tags/debian/1.5.1-3 does not point to a valid object!
git: refs/tags/debian/1.5.1-4 does not point to a valid object!
error: refs/tags/debian/1.5.1-5 does not point to a valid obje
ct!
git: refs/tags/upstream/1.3 does not point to a valid object!
git: refs/tags/upstream/1.5.1 does not point to a valid object!
Total 300 (delta 0), reused 300 (delta 0)

Total 0 (delta 0), reused 0 (delta 0)
Worker failed: An error (1) occurred running quilt in the original tree: None

Applying patch debian/patches/python2.7-testsuite.patch
patching file gflags_unittest.py
Hunk #1 FAILED at 102.
Hunk #2 FAILED at 1411.
2 out of 2 hunks FAILED -- rejects in file gflags_unittest.py
The next patch would create the file test_module_baz.py,
which already exists!  Applying it anyway.
patching file test_module_baz.py
Hunk #1 FAILED at 1.
1 out of 1 hunk FAILED -- rejects in file test_module_baz.py
Patch debian/patches/python2.7-testsuite.patch can be reverse-applied

Elapsed time: 0:00:02.920697

Full worker log