Run of fresh-releases for python-m3u8

767
768
769
770
771
772
773
774
775
776
777
778
779
780
781
    
        # When we try to write it, we'll be prevented from creating the second subdirectory
>       with pytest.raises(OSError):
E       Failed: DID NOT RAISE <class 'OSError'>

tests/test_model.py:629: Failed
=========================== short test summary info ============================
FAILED tests/test_model.py::test_dump_should_raise_if_create_sub_directories_fails
============= 1 failed, 227 passed, 1 skipped, 9 xfailed in 3.33s ==============
E: pybuild pybuild:379: test: plugin distutils failed with: exit code=1: cd /<<PKGBUILDDIR>>/.pybuild/cpython3_3.10_m3u8/build; python3.10 -m pytest tests
dh_auto_test: error: pybuild --test --test-pytest -i python{version} -p 3.10 returned exit code 13
make[1]: *** [debian/rules:14: override_dh_auto_test] Error 25
make[1]: Leaving directory '/<<PKGBUILDDIR>>'
make: *** [debian/rules:7: binary] Error 2
dpkg-buildpackage: error: debian/rules binary subprocess returned exit status 2

Publish Blockers

  • ☒ run was not successful
  • ☑ package has not been removed from the archive
  • ☑ command has not changed
  • ☒ not yet reviewed, but review needed
  • ☑ 0 publish attempts so far.not currently attempting to back off
  • ☒ merge proposals for the package maintainer are currently being rate-limited (open: 529, max open: 300)
  • ☒ change set 96b756ed-523e-4c1e-aca5-87e05a112b5c is working

Full worker log Full build log