Run of fresh-releases for python-miio

Try this locally (using silver-platter):

debian-svp new-upstream python-miio 
2603
2604
2605
2606
2607
2608
2609
2610
2611
2612
2613
2614
2615
2616
2617
ERROR miio/tests/test_vacuum.py - importlib_metadata.PackageNotFoundError: py...
ERROR miio/tests/test_waterpurifier.py - importlib_metadata.PackageNotFoundEr...
ERROR miio/tests/test_wifirepeater.py - importlib_metadata.PackageNotFoundErr...
ERROR miio/tests/test_yeelight.py - importlib_metadata.PackageNotFoundError: ...
ERROR miio/tests/test_yeelight_dual_switch.py - importlib_metadata.PackageNot...
!!!!!!!!!!!!!!!!!!! Interrupted: 42 errors during collection !!!!!!!!!!!!!!!!!!!
============================== 42 errors in 2.15s ==============================
E: pybuild pybuild:353: test: plugin distutils failed with: exit code=2: cd /<<PKGBUILDDIR>>/.pybuild/cpython3_3.9/build; python3.9 -m pytest 
dh_auto_test: error: pybuild --test --test-pytest -i python{version} -p 3.9 returned exit code 13
make[1]: *** [debian/rules:16: override_dh_auto_test] Error 25
make[1]: Leaving directory '/<<PKGBUILDDIR>>'
make: *** [debian/rules:7: binary] Error 2
dpkg-buildpackage: error: debian/rules binary subprocess returned exit status 2
--------------------------------------------------------------------------------
Build finished at 2021-03-28T11:49:39Z

Summary

Merged new upstream version: 0.5.5.2 (was: 0.5.0.1).

Full worker log Full build log (1, 2)