Run of fresh-snapshots for python-motor

Try this locally (using silver-platter):

debian-svp new-upstream --snapshot python-motor 
1
2
3
4
5
6
7
8
9
10
11
12
13
14
15
16
17
18
19
20
21
22
23
24
25
26
27
28
29
30
31
32
33
34
35
36
37
38
39
40
41
42
43
44
45
46
47
48
49
50
51
52
53
54
55
56
57
58
59
60
61
62
63
64
65
66
67
68
69
70
71
72
73
74
75
76
77
78
79
80
81
82
83
84
85
86
87
88
89
90
91
92
93
94
95
96
97
98
99
100
101
102
103
104
105
106
107
108
109
110
111
112
113
114
115
116
117
118
119
120
121
122
Processing: python-motor
Total 685 (delta 388), reused 609 (delta 336)
   
 done.
  26% (4/15)   
Total 24 (delta 5), reused 22 (delta 3)
Total 0 (delta 0), reused 0 (delta 0)
Using upstream branch https://github.com/mongodb/motor.git (from configuration)
Total 8709 (delta 6), reused 9 (delta 2), pack-reused 8689
Using version string 2.0.0+git20190905.34372d1.
Exporting upstream branch revision b'git-v1:34372d1aceaa53a7eb7160fe71ef572e78805f20' to create the tarball
Total 8709 (delta 6), reused 9 (delta 2), pack-reused 8689
0.1.1 does not point to a valid object
0.1.2 does not point to a valid object
0.2.1 does not point to a valid object
0.3.1 does not point to a valid object
0.3.2 does not point to a valid object
0.3.3 does not point to a valid object
0.3.4 does not point to a valid object
1.2.1 does not point to a valid object
1.2.2 does not point to a valid object
1.2.3 does not point to a valid object
1.2.4 does not point to a valid object
1.2.5 does not point to a valid object
1.3.0 does not point to a valid object
1.3.1 does not point to a valid object
/usr/lib/python3/dist-packages/dulwich/repo.py:415: UserWarning: ref refs/tags/1.0 points at non-present sha 965f1b72c6e7820357f3fb3c052e0adcf1ea3d5f
  UserWarning)
/usr/lib/python3/dist-packages/dulwich/repo.py:415: UserWarning: ref refs/tags/1.2rc0 points at non-present sha 009bb6fa36483088d3901e1283c49443f71565f9
  UserWarning)
/usr/lib/python3/dist-packages/dulwich/repo.py:415: UserWarning: ref refs/tags/2.0.0 points at non-present sha 4ac6ec1aa66531e05f4b07746d24960be760f940
  UserWarning)
/usr/lib/python3/dist-packages/dulwich/repo.py:415: UserWarning: ref refs/tags/0.6.2 points at non-present sha 362325190c55d03d19b53ebed3251ed76b17643a
  UserWarning)
/usr/lib/python3/dist-packages/dulwich/repo.py:415: UserWarning: ref refs/tags/1.2.0 points at non-present sha 0f9a5443cccb25d592fad4f1f42440e22ce3c17f
  UserWarning)
/usr/lib/python3/dist-packages/dulwich/repo.py:415: UserWarning: ref refs/tags/0.6.1 points at non-present sha 877387006aca4c19b6e4585498ec685b634858b9
  UserWarning)
/usr/lib/python3/dist-packages/dulwich/repo.py:415: UserWarning: ref refs/tags/0.4.1 points at non-present sha 1d9e028d3239435306b58a36749ceaf37dbb4067
  UserWarning)
/usr/lib/python3/dist-packages/dulwich/repo.py:415: UserWarning: ref refs/tags/0.7 points at non-present sha 01ba04373f30917fc1a22aa195b88ad48df3a3aa
  UserWarning)
/usr/lib/python3/dist-packages/dulwich/repo.py:415: UserWarning: ref refs/tags/1.1 points at non-present sha b3ec6cb068d77b88348419ce6115a97be9b908e2
  UserWarning)
/usr/lib/python3/dist-packages/dulwich/repo.py:415: UserWarning: ref refs/tags/0.7b0 points at non-present sha 20f96422c3153bdcf8222c8973ad6fd2b696a5be
  UserWarning)
/usr/lib/python3/dist-packages/dulwich/repo.py:415: UserWarning: ref refs/tags/1.0 points at non-present sha 965f1b72c6e7820357f3fb3c052e0adcf1ea3d5f
  UserWarning)
/usr/lib/python3/dist-packages/dulwich/repo.py:415: UserWarning: ref refs/tags/1.2rc0 points at non-present sha 009bb6fa36483088d3901e1283c49443f71565f9
  UserWarning)
/usr/lib/python3/dist-packages/dulwich/repo.py:415: UserWarning: ref refs/tags/2.0.0 points at non-present sha 4ac6ec1aa66531e05f4b07746d24960be760f940
  UserWarning)
/usr/lib/python3/dist-packages/dulwich/repo.py:415: UserWarning: ref refs/tags/0.6.2 points at non-present sha 362325190c55d03d19b53ebed3251ed76b17643a
  UserWarning)
/usr/lib/python3/dist-packages/dulwich/repo.py:415: UserWarning: ref refs/tags/1.2.0 points at non-present sha 0f9a5443cccb25d592fad4f1f42440e22ce3c17f
  UserWarning)
/usr/lib/python3/dist-packages/dulwich/repo.py:415: UserWarning: ref refs/tags/0.6.1 points at non-present sha 877387006aca4c19b6e4585498ec685b634858b9
  UserWarning)
/usr/lib/python3/dist-packages/dulwich/repo.py:415: UserWarning: ref refs/tags/0.4.1 points at non-present sha 1d9e028d3239435306b58a36749ceaf37dbb4067
  UserWarning)
/usr/lib/python3/dist-packages/dulwich/repo.py:415: UserWarning: ref refs/tags/0.7 points at non-present sha 01ba04373f30917fc1a22aa195b88ad48df3a3aa
  UserWarning)
/usr/lib/python3/dist-packages/dulwich/repo.py:415: UserWarning: ref refs/tags/1.1 points at non-present sha b3ec6cb068d77b88348419ce6115a97be9b908e2
  UserWarning)
/usr/lib/python3/dist-packages/dulwich/repo.py:415: UserWarning: ref refs/tags/0.7b0 points at non-present sha 20f96422c3153bdcf8222c8973ad6fd2b696a5be
  UserWarning)
1.0 does not point to a valid object
1.2rc0 does not point to a valid object
2.0.0 does not point to a valid object
0.6.2 does not point to a valid object
1.2.0 does not point to a valid object
0.6.1 does not point to a valid object
0.4.1 does not point to a valid object
0.7 does not point to a valid object
1.1 does not point to a valid object
0.7b0 does not point to a valid object
All changes applied successfully.
1.0 does not point to a valid object
1.2rc0 does not point to a valid object
2.0.0 does not point to a valid object
0.6.2 does not point to a valid object
1.2.0 does not point to a valid object
0.6.1 does not point to a valid object
0.4.1 does not point to a valid object
0.7 does not point to a valid object
1.1 does not point to a valid object
0.7b0 does not point to a valid object
Committing to: /home/janitor/tmp/tmptrrn0cti/python-motor/
modified .evergreen/config.yml
modified .evergreen/install-dependencies.sh
modified .evergreen/run-tox.sh
modified debian/changelog
modified doc/changelog.rst
modified doc/requirements.rst
modified motor/__init__.py
modified motor/core.py
modified setup.py
modified synchro/synchrotest.py
modified test/asyncio_tests/test_asyncio_change_stream.py
modified test/asyncio_tests/test_asyncio_client.py
modified test/certificates/ca.pem
modified test/certificates/client.pem
deleted test/certificates/crl.pem
modified test/certificates/server.pem
modified test/tornado_tests/test_motor_change_stream.py
modified test/tornado_tests/test_motor_cursor.py
Committed revision 58.
Worker failed: An error occurred refreshing quilt patch new-crt.patch: 

Applying patch debian/patches/new-crt.patch
patching file test/certificates/ca.pem
Hunk #1 FAILED at 1.
1 out of 1 hunk FAILED -- rejects in file test/certificates/ca.pem
patching file test/certificates/client.pem
Hunk #1 FAILED at 1.
1 out of 1 hunk FAILED -- rejects in file test/certificates/client.pem
patching file test/certificates/server.pem
Hunk #1 FAILED at 1.
1 out of 1 hunk FAILED -- rejects in file test/certificates/server.pem
Patch debian/patches/new-crt.patch does not apply (enforce with -f)

Elapsed time: 0:01:59.054853

Full worker log