Run of fresh-releases for python-parameterized

Try this locally (using silver-platter):

debian-svp new-upstream python-parameterized 
14
15
16
17
18
19
20
21
22
patching file parameterized/test.py
Hunk #1 FAILED at 252.
1 out of 1 hunk FAILED
dpkg-source: info: the patch has fuzz which is not allowed, or is malformed
dpkg-source: info: if patch 'fix-test-for-python3.8.patch' is correctly applied by quilt, use 'quilt refresh' to update it
dpkg-source: info: restoring quilt backup files for fix-test-for-python3.8.patch
dpkg-source: error: LC_ALL=C patch -t -F 0 -N -p1 -u -V never -E -b -B .pc/fix-test-for-python3.8.patch/ --reject-file=- < python-parameterized-0.8.1/debian/patches/fix-test-for-python3.8.patch subprocess returned exit status 1
E: Failed to run dpkg-source --before-build /tmp/tmpdwcvmmod/build-area/python-parameterized-0.8.1
brz: ERROR: The build failed.

Summary

Merged new upstream version: 0.8.1 (was: 0.7.0).

Full worker log Full build log