Run of fresh-releases for python-pex

Try this locally (using silver-platter):

debian-svp new-upstream python-pex 
92
93
94
95
96
97
98
99
100
101
dpkg-source: warning: newly created empty file 'pex/vendor/_vendored/wheel/wheel/vendored/packaging/__init__.py' will not be represented in diff
dpkg-source: warning: executable mode 0755 of 'scripts/package.py' will not be represented in diff
dpkg-source: error: cannot represent change to tests/example_packages/MarkupSafe-1.0-cp27-cp27mu-linux_x86_64.whl: binary file contents changed
dpkg-source: error: add tests/example_packages/MarkupSafe-1.0-cp27-cp27mu-linux_x86_64.whl in debian/source/include-binaries if you want to store the modified binary in the debian tarball
dpkg-source: error: cannot represent change to tests/example_packages/aws_cfn_bootstrap-1.4-py2-none-any.whl: binary file contents changed
dpkg-source: error: add tests/example_packages/aws_cfn_bootstrap-1.4-py2-none-any.whl in debian/source/include-binaries if you want to store the modified binary in the debian tarball
dpkg-source: error: cannot represent change to tests/example_packages/pyparsing-2.1.10-py2.py3-none-any.whl: binary file contents changed
dpkg-source: error: add tests/example_packages/pyparsing-2.1.10-py2.py3-none-any.whl in debian/source/include-binaries if you want to store the modified binary in the debian tarball
E: Failed to package source directory /home/janitor/tmp/tmpcaiuhpgf/build-area/python-pex-1.1.14
brz: ERROR: The build failed.

Summary

Merged new upstream version: 2.1.21 (was: 1.1.14).

Full worker log Full build log