Run of lintian-fixes for python-pskc

Try this locally (using the lintian-brush package):

debcheckout python-pskc
cd python-pskc
lintian-brush
960
961
962
963
964
965
966
967
968
969
970
971
972
973
974
975

The manual pages are in build/sphinx/man.
make[1]: Leaving directory '/<<PKGBUILDDIR>>'
   debian/rules override_dh_auto_test
make[1]: Entering directory '/<<PKGBUILDDIR>>'
PYBUILD_TEST_ARGS='--system=custom --test-args='"'"'PYTHONWARNINGS=all TZ=Europe/Amsterdam {interpreter} setup.py nosetests --exclude="(test_signature|test_pskc2csv).doctest" --cover-min-percentage 95'"'"'' dh_auto_test
I: pybuild base:217: cd /<<PKGBUILDDIR>>/.pybuild/cpython3_3.8_pskc/build; python3.8 -m nose -v --system=custom --test-args='PYTHONWARNINGS=all TZ=Europe/Amsterdam python3.8 setup.py nosetests --exclude="(test_signature|test_pskc2csv).doctest" --cover-min-percentage 95'
Usage: python3.8 -m nose [options]

python3.8 -m nose: error: no such option: --system
E: pybuild pybuild:352: test: plugin distutils failed with: exit code=2: cd /<<PKGBUILDDIR>>/.pybuild/cpython3_3.8_pskc/build; python3.8 -m nose -v --system=custom --test-args='PYTHONWARNINGS=all TZ=Europe/Amsterdam {interpreter} setup.py nosetests --exclude="(test_signature|test_pskc2csv).doctest" --cover-min-percentage 95'
dh_auto_test: error: pybuild --test --test-nose -i python{version} -p 3.8 returned exit code 13
make[1]: *** [debian/rules:16: override_dh_auto_test] Error 25
make[1]: Leaving directory '/<<PKGBUILDDIR>>'
make: *** [debian/rules:6: build] Error 2
dpkg-buildpackage: error: debian/rules build subprocess returned exit status 2

Summary

Full build log Full worker log