Run of fresh-releases for python-traits

Try this locally (using silver-platter):

debian-svp new-upstream python-traits 
1
2
3
4
5
6
7
8
9
10
11
12
13
14
15
16
17
18
19
20
21
22
23
24
25
26
27
28
29
30
31
32
33
34
35
36
37
38
39
40
41
42
43
44
45
46
47
48
49
50
51
52
53
54
55
56
57
58
59
60
61
62
63
64
65
66
67
68
69
70
71
72
73
74
75
76
77
78
79
80
81
82
83
84
85
86
87
88
89
90
91
92
93
94
95
96
97
98
99
100
101
102
103
104
105
106
107
108
109
110
111
112
113
114
115
116
117
118
119
120
121
122
123
124
125
126
127
128
129
130
131
132
133
134
135
136
137
138
139
140
141
142
143
144
145
146
147
148
149
150
151
152
153
154
155
156
157
158
159
160
161
162
163
164
165
166
167
168
169
170
171
172
173
174
175
176
177
178
179
180
181
182
183
184
185
186
187
188
189
190
191
192
193
194
195
196
197
198
199
200
201
202
203
204
205
206
207
208
209
210
211
212
213
214
215
216
217
218
219
220
221
222
223
224
225
226
227
228
229
230
231
232
233
234
235
236
237
238
239
240
241
242
243
244
245
246
247
248
249
250
251
252
253
254
255
256
257
258
259
260
261
262
263
264
265
266
267
268
269
270
271
272
273
274
275
276
277
278
279
280
281
282
283
284
285
286
287
288
289
290
291
292
293
294
295
296
297
298
299
300
301
302
303
304
305
306
307
308
309
310
311
312
313
314
315
316
317
318
319
320
321
322
323
324
325
326
327
328
329
330
331
332
333
334
335
336
337
338
339
340
341
342
343
344
345
346
347
348
349
350
351
352
353
354
355
356
357
358
359
360
361
362
363
364
365
366
367
Processing: python-traits
Total 2381 (delta 1465), reused 2345 (delta 1439)
Total 48 (delta 22), reused 48 (delta 22)
Total 0 (delta 0), reused 0 (delta 0)

/usr/lib/python3/dist-packages/pkginfo/develop.py:45: UserWarning: No PKG-INFO found for path: /home/janitor/tmp/tmpcm25tt_8/python-traits
  warnings.warn('No PKG-INFO found for path: %s' % self.path)
Using upstream branch https://github.com/enthought/traits (guessed)
Total 17847 (delta 49), reused 38 (delta 36), pack-reused 17784
Using version string 5.1.2.
No upstream upstream-revision format specified, trying tag:5.1.2
Using uscan to look for the upstream tarball.
Total 17738 (delta 42), reused 31 (delta 31), pack-reused 17690
3.0.0 does not point to a valid object
3.0.1 does not point to a valid object
3.0.2 does not point to a valid object
3.0.3 does not point to a valid object
3.1.0 does not point to a valid object
3.2.0 does not point to a valid object
3.3.0 does not point to a valid object
3.4.0 does not point to a valid object
3.5.0 does not point to a valid object
3.6.0 does not point to a valid object
/usr/lib/python3/dist-packages/dulwich/repo.py:415: UserWarning: ref refs/tags/5.0.0 points at non-present sha 0683a5945b269a550e2d066503b48d12f14215b9
  UserWarning)
/usr/lib/python3/dist-packages/dulwich/repo.py:415: UserWarning: ref refs/tags/5.1.0 points at non-present sha 367256d401d8b61e924bd5a2a2743b515e4ecaf6
  UserWarning)
/usr/lib/python3/dist-packages/dulwich/repo.py:415: UserWarning: ref refs/tags/4.5.0 points at non-present sha 606d5f66ca4baf7d90eeb00c0fb7bb4e2907d0ae
  UserWarning)
/usr/lib/python3/dist-packages/dulwich/repo.py:415: UserWarning: ref refs/tags/4.0.0 points at non-present sha e400f6ea02aca4c934bad0552d0a1000b76a568b
  UserWarning)
/usr/lib/python3/dist-packages/dulwich/repo.py:415: UserWarning: ref refs/tags/4.4.0 points at non-present sha cfb91037c56c8a5ba7e5ecb17b3401941d62b172
  UserWarning)
/usr/lib/python3/dist-packages/dulwich/repo.py:415: UserWarning: ref refs/tags/release/5.0.0 points at non-present sha 41a7a4b1d47ce047468538adb5b58b3c3baa83ee
  UserWarning)
/usr/lib/python3/dist-packages/dulwich/repo.py:415: UserWarning: ref refs/tags/4.5.0-rc.1 points at non-present sha d2bba2f11e8d242eaa06381f516a04240182fde7
  UserWarning)
/usr/lib/python3/dist-packages/dulwich/repo.py:415: UserWarning: ref refs/tags/4.3.0 points at non-present sha 2ca5b025072919241b47768dd8513d67900aa52e
  UserWarning)
/usr/lib/python3/dist-packages/dulwich/repo.py:415: UserWarning: ref refs/tags/4.2.0 points at non-present sha 0afc79d4de81db5fb55b056553b74128130fa063
  UserWarning)
/usr/lib/python3/dist-packages/dulwich/repo.py:415: UserWarning: ref refs/tags/5.1.1 points at non-present sha ea16747ef43ca69e10cc9dcac01aece68ed3464b
  UserWarning)
/usr/lib/python3/dist-packages/dulwich/repo.py:415: UserWarning: ref refs/tags/4.1.0 points at non-present sha 265b2abc3062eb7d03700d52063fbc5cafefdfed
  UserWarning)
/usr/lib/python3/dist-packages/dulwich/repo.py:415: UserWarning: ref refs/tags/5.0.0 points at non-present sha 0683a5945b269a550e2d066503b48d12f14215b9
  UserWarning)
/usr/lib/python3/dist-packages/dulwich/repo.py:415: UserWarning: ref refs/tags/5.1.0 points at non-present sha 367256d401d8b61e924bd5a2a2743b515e4ecaf6
  UserWarning)
/usr/lib/python3/dist-packages/dulwich/repo.py:415: UserWarning: ref refs/tags/4.5.0 points at non-present sha 606d5f66ca4baf7d90eeb00c0fb7bb4e2907d0ae
  UserWarning)
/usr/lib/python3/dist-packages/dulwich/repo.py:415: UserWarning: ref refs/tags/4.0.0 points at non-present sha e400f6ea02aca4c934bad0552d0a1000b76a568b
  UserWarning)
/usr/lib/python3/dist-packages/dulwich/repo.py:415: UserWarning: ref refs/tags/4.4.0 points at non-present sha cfb91037c56c8a5ba7e5ecb17b3401941d62b172
  UserWarning)
/usr/lib/python3/dist-packages/dulwich/repo.py:415: UserWarning: ref refs/tags/release/5.0.0 points at non-present sha 41a7a4b1d47ce047468538adb5b58b3c3baa83ee
  UserWarning)
/usr/lib/python3/dist-packages/dulwich/repo.py:415: UserWarning: ref refs/tags/4.5.0-rc.1 points at non-present sha d2bba2f11e8d242eaa06381f516a04240182fde7
  UserWarning)
/usr/lib/python3/dist-packages/dulwich/repo.py:415: UserWarning: ref refs/tags/4.3.0 points at non-present sha 2ca5b025072919241b47768dd8513d67900aa52e
  UserWarning)
/usr/lib/python3/dist-packages/dulwich/repo.py:415: UserWarning: ref refs/tags/4.2.0 points at non-present sha 0afc79d4de81db5fb55b056553b74128130fa063
  UserWarning)
/usr/lib/python3/dist-packages/dulwich/repo.py:415: UserWarning: ref refs/tags/5.1.1 points at non-present sha ea16747ef43ca69e10cc9dcac01aece68ed3464b
  UserWarning)
/usr/lib/python3/dist-packages/dulwich/repo.py:415: UserWarning: ref refs/tags/4.1.0 points at non-present sha 265b2abc3062eb7d03700d52063fbc5cafefdfed
  UserWarning)
5.0.0 does not point to a valid object
5.1.0 does not point to a valid object
4.5.0 does not point to a valid object
4.0.0 does not point to a valid object
4.4.0 does not point to a valid object
release/5.0.0 does not point to a valid object
4.5.0-rc.1 does not point to a valid object
4.3.0 does not point to a valid object
4.2.0 does not point to a valid object
5.1.1 does not point to a valid object
4.1.0 does not point to a valid object
All changes applied successfully.
5.0.0 does not point to a valid object
5.1.0 does not point to a valid object
4.5.0 does not point to a valid object
4.0.0 does not point to a valid object
4.4.0 does not point to a valid object
release/5.0.0 does not point to a valid object
4.5.0-rc.1 does not point to a valid object
4.3.0 does not point to a valid object
4.2.0 does not point to a valid object
5.1.1 does not point to a valid object
4.1.0 does not point to a valid object
Committing to: /home/janitor/tmp/tmpcm25tt_8/python-traits/
modified .coveragerc
modified .gitignore
modified .travis.yml
deleted .travis_before_install
added CHANGES.rst
deleted CHANGES.txt
modified LICENSE.txt
modified MANIFEST.in
modified README.rst
deleted TODO.txt
added appveyor-clean-cache.txt
added appveyor.yml
added ci-doc-requirements.txt
added ci-src-requirements.txt
modified debian/changelog
modified docs/Makefile
deleted docs/Pydoh_T3UMdoc_HOWTO.txt
deleted docs/Traits3_UM.doc
deleted docs/Traits3_UM.pdf
deleted docs/Traits3_UM_add.css
deleted docs/api.css
added docs/make.bat
modified docs/source/_extensions/refactordoc/__init__.py
modified docs/source/_extensions/refactordoc/base_doc.py
modified docs/source/_extensions/refactordoc/class_doc.py
modified docs/source/_extensions/refactordoc/definition_items.py
modified docs/source/_extensions/refactordoc/function_doc.py
modified docs/source/_extensions/refactordoc/line_functions.py
modified docs/source/conf.py
deleted docs/source/traits_api_reference/adapter.rst
modified docs/source/traits_api_reference/category.rst
modified docs/source/traits_api_reference/has_traits.rst
modified docs/source/traits_api_reference/index.rst
modified docs/source/traits_api_reference/trait_numeric.rst
modified docs/source/traits_api_reference/trait_types.rst
modified docs/source/traits_api_reference/traits.adaptation.rst
modified docs/source/traits_api_reference/traits.protocols.rst
modified docs/source/traits_api_reference/traits.rst
modified docs/source/traits_api_reference/traits.util.rst
modified docs/source/traits_user_manual/advanced.rst
modified docs/source/traits_user_manual/custom.rst
added docs/source/traits_user_manual/debugging.rst
modified docs/source/traits_user_manual/deferring.rst
modified docs/source/traits_user_manual/defining.rst
modified docs/source/traits_user_manual/front.rst
modified docs/source/traits_user_manual/index.rst
modified docs/source/traits_user_manual/intro.rst
modified docs/source/traits_user_manual/notification.rst
modified docs/source/traits_user_manual/testing.rst
deleted docs/traitsdocreadme.txt
added etstool.py
modified examples/tutorials/doc_examples/examples/adapt_metadata.py
modified examples/tutorials/doc_examples/examples/add_class_trait.py
modified examples/tutorials/doc_examples/examples/all_traits_features.py
modified examples/tutorials/doc_examples/examples/all_wildcard.py
modified examples/tutorials/doc_examples/examples/bad_self_ref.py
modified examples/tutorials/doc_examples/examples/cached_prop.py
modified examples/tutorials/doc_examples/examples/circular_definition.py
modified examples/tutorials/doc_examples/examples/compound.py
modified examples/tutorials/doc_examples/examples/configure_traits.py
modified examples/tutorials/doc_examples/examples/custom_traithandler.py
modified examples/tutorials/doc_examples/examples/deferring_notification.py
modified examples/tutorials/doc_examples/examples/delegate.py
modified examples/tutorials/doc_examples/examples/disallow.py
modified examples/tutorials/doc_examples/examples/dynamic_notification.py
modified examples/tutorials/doc_examples/examples/event.py
modified examples/tutorials/doc_examples/examples/external_adapter.py
modified examples/tutorials/doc_examples/examples/interface_definition.py
modified examples/tutorials/doc_examples/examples/interface_implementation.py
modified examples/tutorials/doc_examples/examples/keywords.py
modified examples/tutorials/doc_examples/examples/list_notifier.py
modified examples/tutorials/doc_examples/examples/mapped.py
modified examples/tutorials/doc_examples/examples/metadata.py
modified examples/tutorials/doc_examples/examples/minimal.py
modified examples/tutorials/doc_examples/examples/object_trait_attrs.py
modified examples/tutorials/doc_examples/examples/override_default.py
modified examples/tutorials/doc_examples/examples/prototype_prefix.py
modified examples/tutorials/doc_examples/examples/scratch_adapter.py
modified examples/tutorials/doc_examples/examples/simple_adapter.py
modified examples/tutorials/doc_examples/examples/static_notification.py
modified examples/tutorials/doc_examples/examples/temp_wildcard.py
modified examples/tutorials/doc_examples/examples/this.py
modified examples/tutorials/doc_examples/examples/trait_reuse.py
modified examples/tutorials/doc_examples/examples/trait_subclass.py
modified examples/tutorials/doc_examples/examples/traitprefixmap.py
modified examples/tutorials/doc_examples/examples/transient_metadata.py
modified examples/tutorials/doc_examples/examples/use_custom_th.py
modified examples/tutorials/doc_examples/examples/widget.py
modified examples/tutorials/doc_examples/examples/wildcard.py
modified examples/tutorials/doc_examples/examples/wildcard_all.py
modified examples/tutorials/doc_examples/examples/wildcard_name.py
modified examples/tutorials/doc_examples/examples/wildcard_rules.py
modified examples/tutorials/doc_examples/examples/wizard.py
modified examples/tutorials/traits_4.0/decorators/cached_property.py
modified examples/tutorials/traits_4.0/decorators/on_trait_change.py
modified examples/tutorials/traits_4.0/delegation/delegation.py
modified examples/tutorials/traits_4.0/extended_trait_change/extended_trait_change.py
modified examples/tutorials/traits_4.0/extended_trait_change/properties.py
modified examples/tutorials/traits_4.0/getstate_setstate/getstate.py
modified examples/tutorials/traits_4.0/interfaces/adaptation.py
modified examples/tutorials/traits_4.0/interfaces/interfaces.py
modified examples/tutorials/traits_4.0/trait_types/core_traits.py
modified examples/tutorials/traits_4.0/trait_types/new_types.py
modified examples/tutorials/traits_4.0/trait_types/trait_types.py
modified examples/tutorials/tutor.py
added install-edm-linux.sh
added install-edm-osx.sh
added install-edm-windows.cmd
modified setup.py
added tox.ini
modified traits/__init__.py
modified traits/_py2to3.py
modified traits/adaptation/__init__.py
modified traits/adaptation/adaptation_error.py
modified traits/adaptation/adaptation_manager.py
modified traits/adaptation/adaptation_offer.py
modified traits/adaptation/adapter.py
modified traits/adaptation/api.py
deleted traits/adaptation/cached_adapter_factory.py
modified traits/adaptation/tests/abc_examples.py
modified traits/adaptation/tests/benchmark.py
modified traits/adaptation/tests/interface_examples.py
modified traits/adaptation/tests/lazy_examples.py
modified traits/adaptation/tests/test_adaptation_manager.py
modified traits/adaptation/tests/test_adaptation_offer.py
modified traits/adaptation/tests/test_adapter.py
deleted traits/adaptation/tests/test_cached_adapter_factory.py
modified traits/adaptation/tests/test_global_adaptation_manager.py
deleted traits/adapter.py
modified traits/api.py
modified traits/category.py
modified traits/ctraits.c
modified traits/etsconfig/__init__.py
modified traits/etsconfig/api.py
modified traits/etsconfig/etsconfig.py
modified traits/etsconfig/tests/test_etsconfig.py
modified traits/has_dynamic_views.py
modified traits/has_traits.py
modified traits/interface_checker.py
deleted traits/protocols
deleted traits/protocols/README.txt
deleted traits/protocols/__init__.py
deleted traits/protocols/advice.py
deleted traits/protocols/api.py
modified traits/testing/__init__.py
modified traits/testing/api.py
deleted traits/testing/dependencies
deleted traits/testing/dependencies/ImportManager.py
deleted traits/testing/dependencies/ImportSpy.py
deleted traits/testing/dependencies/circular_test.py
deleted traits/testing/dependencies/deptrack.py
modified traits/testing/doctest_tools.py
modified traits/testing/nose_tools.py
modified traits/testing/tests/test_unittest_tools.py
modified traits/testing/unittest_tools.py
modified traits/tests/__init__.py
modified traits/tests/check_timing.py
added traits/tests/test__py2to3.py
modified traits/tests/test_abc.py
modified traits/tests/test_anytrait_static_notifiers.py
modified traits/tests/test_array.py
added traits/tests/test_array_or_none.py
modified traits/tests/test_automatic_adaptation.py
added traits/tests/test_bool.py
modified traits/tests/test_category.py
modified traits/tests/test_class_traits.py
modified traits/tests/test_clone.py
modified traits/tests/test_container_events.py
modified traits/tests/test_copy_traits.py
modified traits/tests/test_copyable_trait_names.py
modified traits/tests/test_cythonized_traits.py
modified traits/tests/test_delegate.py
modified traits/tests/test_dict.py
added traits/tests/test_directory.py
modified traits/tests/test_dynamic_notifiers.py
modified traits/tests/test_dynamic_trait_definition.py
added traits/tests/test_editor_factories.py
modified traits/tests/test_enum.py
modified traits/tests/test_event_order.py
deleted traits/tests/test_events.py
modified traits/tests/test_extended_notifiers.py
modified traits/tests/test_extended_trait_change.py
added traits/tests/test_file.py
added traits/tests/test_float.py
added traits/tests/test_get_traits.py
added traits/tests/test_has_required_traits.py
added traits/tests/test_has_traits.py
modified traits/tests/test_int_range_long.py
modified traits/tests/test_integer.py
modified traits/tests/test_interface_checker.py
modified traits/tests/test_interfaces.py
deleted traits/tests/test_interfaces_with_implements.py
modified traits/tests/test_keyword_args.py
modified traits/tests/test_list.py
added traits/tests/test_list_events.py
modified traits/tests/test_listeners.py
modified traits/tests/test_new_notifiers.py
modified traits/tests/test_pickle_validated_dict.py
modified traits/tests/test_property_delete.py
modified traits/tests/test_property_notifications.py
deleted traits/tests/test_protocols_usage.py
modified traits/tests/test_range.py
modified traits/tests/test_regression.py
modified traits/tests/test_rich_compare.py
modified traits/tests/test_special_event_handlers.py
modified traits/tests/test_static_notifiers.py
modified traits/tests/test_str_handler.py
added traits/tests/test_string.py
modified traits/tests/test_sync_traits.py
modified traits/tests/test_target.py
modified traits/tests/test_trait_change_event_tracer.py
modified traits/tests/test_trait_cycle.py
modified traits/tests/test_trait_default_initializer.py
added traits/tests/test_trait_exceptions.py
added traits/tests/test_trait_get_set.py
modified traits/tests/test_trait_list_dict.py
modified traits/tests/test_trait_types.py
modified traits/tests/test_traits.py
modified traits/tests/test_tuple.py
modified traits/tests/test_ui_notifiers.py
modified traits/tests/test_undefined.py
added traits/tests/test_uuid.py
added traits/tests/test_validated_tuple.py
modified traits/tests/test_weak_ref.py
added traits/tests/tuple_test_mixin.py
modified traits/trait_base.py
modified traits/trait_errors.py
modified traits/trait_handlers.py
modified traits/trait_notifiers.py
modified traits/trait_numeric.py
modified traits/trait_types.py
modified traits/trait_value.py
modified traits/traits.py
modified traits/traits_listener.py
modified traits/ustr_trait.py
modified traits/util/__init__.py
modified traits/util/api.py
modified traits/util/async_trait_wait.py
modified traits/util/camel_case.py
modified traits/util/clean_strings.py
modified traits/util/deprecated.py
added traits/util/event_tracer.py
modified traits/util/home_directory.py
modified traits/util/import_symbol.py
modified traits/util/resource.py
modified traits/util/tests/test_async_trait_wait.py
modified traits/util/tests/test_camel_case.py
added traits/util/tests/test_deprecated.py
modified traits/util/tests/test_import_symbol.py
added traits/util/tests/test_message_records.py
added traits/util/tests/test_record_containers.py
added traits/util/tests/test_record_events.py
added traits/util/tests/test_trait_documenter.py
added traits/util/tests/test_weakidddict.py
modified traits/util/toposort.py
modified traits/util/trait_documenter.py
added traits/util/weakiddict.py
Committed revision 29.
Committing to: /home/janitor/tmp/tmpcm25tt_8/python-traits/
modified debian/changelog
missing debian/patches/remove_testing_dependencies_class.patch
deleted debian/patches/remove_testing_dependencies_class.patch
modified debian/patches/series
Committed revision 30.
Worker failed: An error (1) occurred refreshing quilt patches: None

Applying patch debian/patches/py3_sort_fix.patch
patching file traits/tests/test_list.py
Hunk #1 FAILED at 255.
1 out of 1 hunk FAILED -- rejects in file traits/tests/test_list.py
patching file traits/trait_handlers.py
Hunk #1 FAILED at 2561.
1 out of 1 hunk FAILED -- rejects in file traits/trait_handlers.py
Patch debian/patches/py3_sort_fix.patch does not apply (enforce with -f)

Elapsed time: 0:07:52.097082

Full worker log