Run of fresh-snapshots for rapid-photo-downloader

Try this locally (using silver-platter):

debian-svp new-upstream --snapshot rapid-photo-downloader 
117
118
119
120
121
122
123
124
125
126
127
128
129
130
dpkg-source: error: cannot represent change to tips/thumbnailsort.png: binary file contents changed
dpkg-source: error: add tips/thumbnailsort.png in debian/source/include-binaries if you want to store the modified binary in the debian tarball
dpkg-source: error: cannot represent change to tips/timeline.png: binary file contents changed
dpkg-source: error: add tips/timeline.png in debian/source/include-binaries if you want to store the modified binary in the debian tarball
dpkg-source: error: cannot represent change to tips/timelineadjust.png: binary file contents changed
dpkg-source: error: add tips/timelineadjust.png in debian/source/include-binaries if you want to store the modified binary in the debian tarball
dpkg-source: error: cannot represent change to tips/timelineselect.png: binary file contents changed
dpkg-source: error: add tips/timelineselect.png in debian/source/include-binaries if you want to store the modified binary in the debian tarball
dpkg-source: warning: executable mode 0755 of 'tools/capture_screenshot.py' will not be represented in diff
dpkg-source: warning: file rapid-photo-downloader-0.9.23/tools/correct_permissions.py has no final newline (either original or modified version)
dpkg-source: warning: executable mode 0755 of 'tools/extract_po_files.py' will not be represented in diff
dpkg-source: warning: executable mode 0755 of 'tools/log_file_extract.py' will not be represented in diff
E: Failed to package source directory /home/janitor/tmp/tmpvfhj7oj8/build-area/rapid-photo-downloader-0.9.23
brz: ERROR: The build failed.

Summary

Merged new upstream version: 0.9.23+bzr1284 (was: 0.9.23).

Full worker log Full build log