Run of fresh-releases for reactphp-promise-timer

Try this locally (using silver-platter):

debian-svp new-upstream reactphp-promise-timer 
11
12
13
14
15
16
17
18
19
20
21
dpkg-source: info: using patch list from debian/patches/series
patching file composer.json
Hunk #1 FAILED at 19.
1 out of 1 hunk FAILED
dpkg-source: info: the patch has fuzz which is not allowed, or is malformed
dpkg-source: info: if patch 'fix_deps.patch' is correctly applied by quilt, use 'quilt refresh' to update it
dpkg-source: error: LC_ALL=C patch -t -F 0 -N -p1 -u -V never -E -b -B .pc/fix_deps.patch/ --reject-file=- < reactphp-promise-timer-1.6.0.orig.rIE0f9/debian/patches/fix_deps.patch subprocess returned exit status 1
E: Failed to open build log /home/janitor/tmp/tmpb1wq0kky/build-area//home/janitor/tmp/tmpb1wq0kky/build-area/reactphp-promise-timer_1.6.0-1~jan+nur1.dsc_amd64-2021-03-29T02:22:17Z.build: No such file or directory
print() on closed filehandle $PLOG at /usr/share/perl5/Sbuild/Base.pm line 90.
E: unable to mktemp
brz: ERROR: The build failed.

Summary

Merged new upstream version: 1.6.0 (was: 1.5.0).

Full worker log Full build log