Run of fresh-releases for recommonmark

Try this locally (using silver-platter):

debian-svp new-upstream recommonmark 
1
2
3
4
5
6
7
8
9
10
11
12
13
14
15
16
17
18
19
20
21
22
23
24
25
26
27
28
29
30
31
32
33
34
35
36
37
38
39
40
41
42
43
44
45
46
47
48
49
50
51
52
53
54
55
56
57
58
59
Processing: recommonmark
git: refs/tags/debian/0.4.0+ds-1 does not point to a valid object!
git: refs/tags/debian/0.4.0+ds-3 does not point to a valid object!
git: refs/tags/debian/0.4.0+ds-4 does not point to a valid object!
git: refs/tags/debian/0.4.0+ds-5 does not point to a valid object!
Total 128 (delta 22), reused 106 (delta 0)

Using version string 0.5.0.
Using uscan to look for the upstream tarball.
Not storing pristine-tar metadata, since there is no pristine-tar branch.
All changes applied successfully.
Committing to: /home/janitor/tmp/tmpmkmv8y6w/recommonmark/
added CHANGELOG.md
added MANIFEST.in
modified PKG-INFO
added README.md
modified debian/changelog
added docs
added docs/Makefile
added docs/api_ref.md
added docs/auto_structify.md
added docs/conf.py
added docs/index.md
added license.md
modified recommonmark/__init__.py
modified recommonmark/parser.py
modified recommonmark/scripts.py
modified recommonmark/states.py
modified recommonmark/transform.py
modified setup.py
added tests
added tests/__init__.py
added tests/sphinx_code_block
added tests/sphinx_code_block/conf.py
added tests/sphinx_custom_md
added tests/sphinx_custom_md/conf.py
added tests/sphinx_generic
added tests/sphinx_generic/conf.py
added tests/sphinx_indented_code
added tests/sphinx_indented_code/conf.py
added tests/sphinx_nested_header_block
added tests/sphinx_nested_header_block/conf.py
added tests/sphinx_xref
added tests/sphinx_xref/conf.py
added tests/test_basic.py
added tests/test_sphinx.py
Committed revision 14.
Worker failed: An error (1) occurred refreshing quilt patches: None

Applying patch debian/patches/debianization.patch
patching file recommonmark/parser.py
Hunk #1 FAILED at 3.
1 out of 1 hunk FAILED -- rejects in file recommonmark/parser.py
patching file setup.py
Hunk #1 FAILED at 11.
1 out of 1 hunk FAILED -- rejects in file setup.py
Patch debian/patches/debianization.patch does not apply (enforce with -f)

Elapsed time: 0:00:22.113931

Full worker log