Run of unchanged for reprotest

Try this locally (using the lintian-brush package):

debcheckout reprotest
cd reprotest
just-build
1413
1414
1415
1416
1417
1418
1419
1420
1421
1422
1423
1424
1425
1426
1427
 debian/rules binary
dh binary --with python3 --buildsystem=pybuild
   dh_update_autotools_config -O--buildsystem=pybuild
   dh_autoreconf -O--buildsystem=pybuild
   debian/rules override_dh_auto_configure
make[1]: Entering directory '/<<PKGBUILDDIR>>'
test $(python3 setup.py --version) = $(echo 0.7.16~jan+unchanged1 | cut -f1 -d'+')
make[1]: *** [debian/rules:23: override_dh_auto_configure] Error 1
make[1]: Leaving directory '/<<PKGBUILDDIR>>'
make: *** [debian/rules:9: binary] Error 2
dpkg-buildpackage: error: debian/rules binary subprocess returned exit status 2
--------------------------------------------------------------------------------
Build finished at 2020-11-21T21:48:58Z

Finished

Full worker log Full build log