Run of fresh-releases for ruby-em-synchrony

Try this locally (using silver-platter):

debian-svp new-upstream ruby-em-synchrony 
1574
1575
1576
1577
1578
1579
1580
1581
1582
1583
1584
1585
1586
1587
1588
/usr/share/rubygems-integration/all/gems/rake-13.0.3/exe/rake:27:in `<top (required)>'
Tasks: TOP => default
(See full trace by running task with --trace)
ERROR: Test "ruby2.7" failed. Exiting.
dh_auto_install: error: dh_ruby --install /<<PKGBUILDDIR>>/debian/ruby-em-synchrony returned exit code 1
make: *** [debian/rules:15: binary] Error 25
dpkg-buildpackage: error: fakeroot debian/rules binary subprocess returned exit status 2
E: Build killed with signal TERM after 150 minutes of inactivity
--------------------------------------------------------------------------------
Build finished at 2021-04-09T23:35:28Z

Finished
--------


Summary

Merged new upstream version: 1.0.6 (was: 1.0.5).

Full worker log Full build log