Run of fresh-releases for ruby-faye

Try this locally (using silver-platter):

debian-svp new-upstream ruby-faye 
43
44
45
46
47
48
49
50
51
52
dpkg-source: error: cannot represent change to site/site/images/nokia_mix_party.png: binary file contents changed
dpkg-source: error: add site/site/images/nokia_mix_party.png in debian/source/include-binaries if you want to store the modified binary in the debian tarball
dpkg-source: error: cannot represent change to site/site/images/pathient.png: binary file contents changed
dpkg-source: error: add site/site/images/pathient.png in debian/source/include-binaries if you want to store the modified binary in the debian tarball
dpkg-source: error: cannot represent change to site/site/images/podio.png: binary file contents changed
dpkg-source: error: add site/site/images/podio.png in debian/source/include-binaries if you want to store the modified binary in the debian tarball
dpkg-source: error: cannot represent change to site/site/images/xydo.png: binary file contents changed
dpkg-source: error: add site/site/images/xydo.png in debian/source/include-binaries if you want to store the modified binary in the debian tarball
E: Failed to package source directory /home/janitor/tmp/tmplrye2p5y/build-area/ruby-faye-1.2.4
brz: ERROR: The build failed.

Summary

Merged new upstream version: 1.4.0 (was: 1.2.4).

Full worker log Full build log