Run of fresh-releases for ruby-googleauth

Try this locally (using silver-platter):

debian-svp new-upstream ruby-googleauth 
11
12
13
14
15
16
17
18
19
20
21
dpkg-source: info: using patch list from debian/patches/series
patching file googleauth.gemspec
Hunk #1 FAILED at 18.
1 out of 1 hunk FAILED
dpkg-source: info: the patch has fuzz which is not allowed, or is malformed
dpkg-source: info: if patch 'remove-git-in-gemspec.patch' is correctly applied by quilt, use 'quilt refresh' to update it
dpkg-source: error: LC_ALL=C patch -t -F 0 -N -p1 -u -V never -E -b -B .pc/remove-git-in-gemspec.patch/ --reject-file=- < ruby-googleauth-0.16.0.orig.PyHYnN/debian/patches/remove-git-in-gemspec.patch subprocess returned exit status 1
E: Failed to open build log /tmp/tmpf6jgb29q/build-area//tmp/tmpf6jgb29q/build-area/ruby-googleauth_0.16.0-1~jan+nur1.dsc_amd64-2021-03-28T08:25:32Z.build: No such file or directory
print() on closed filehandle $PLOG at /usr/share/perl5/Sbuild/Base.pm line 90.
E: unable to mktemp
brz: ERROR: The build failed.

Summary

Merged new upstream version: 0.16.0 (was: 0.13.0).

Full worker log Full build log