Run of fresh-releases for ruby-haml

Try this locally (using silver-platter):

debian-svp new-upstream ruby-haml 
12
13
14
15
16
17
18
19
20
21
22
patching file test/test_helper.rb
Hunk #1 FAILED at 14.
Hunk #2 succeeded at 11 (offset -11 lines).
1 out of 2 hunks FAILED
dpkg-source: info: the patch has fuzz which is not allowed, or is malformed
dpkg-source: info: if patch 'no_bundler_in_tests' is correctly applied by quilt, use 'quilt refresh' to update it
dpkg-source: error: LC_ALL=C patch -t -F 0 -N -p1 -u -V never -E -b -B .pc/no_bundler_in_tests/ --reject-file=- < ruby-haml-5.2.1.orig.L_zA_N/debian/patches/no_bundler_in_tests subprocess returned exit status 1
E: Failed to open build log /home/janitor/tmp/tmp5um49r2d/build-area//home/janitor/tmp/tmp5um49r2d/build-area/ruby-haml_5.2.1-1~jan+nur1.dsc_amd64-2021-03-29T08:13:35Z.build: No such file or directory
print() on closed filehandle $PLOG at /usr/share/perl5/Sbuild/Base.pm line 90.
E: unable to mktemp
brz: ERROR: The build failed.

Summary

Merged new upstream version: 5.2.1 (was: 5.1.2).

Full worker log Full build log