Run of fresh-snapshots for ruby-http

Try this locally (using silver-platter):

debian-svp new-upstream --snapshot ruby-http 
17
18
19
20
21
22
23
24
25
patching file spec/lib/http/client_spec.rb
Hunk #1 FAILED at 288.
1 out of 1 hunk FAILED
dpkg-source: info: the patch has fuzz which is not allowed, or is malformed
dpkg-source: info: if patch 'disable-ssl-tests.patch' is correctly applied by quilt, use 'quilt refresh' to update it
dpkg-source: info: restoring quilt backup files for disable-ssl-tests.patch
dpkg-source: error: LC_ALL=C patch -t -F 0 -N -p1 -u -V never -E -b -B .pc/disable-ssl-tests.patch/ --reject-file=- < ruby-http-5.0.0.pre3+git20210304.1.8f8682c/debian/patches/disable-ssl-tests.patch subprocess returned exit status 1
E: Failed to run dpkg-source --before-build /home/janitor/tmp/tmp7beajdo5/build-area/ruby-http-5.0.0.pre3+git20210304.1.8f8682c
brz: ERROR: The build failed.

Summary

Merged new upstream version: 5.0.0.pre3+git20210304.1.8f8682c (was: 4.4.1).

Full worker log Full build log Full dist log