Run of fresh-releases for ruby-invisible-captcha

Try this locally (using silver-platter):

debian-svp new-upstream ruby-invisible-captcha 
12
13
14
15
16
17
18
19
20
patching file invisible_captcha.gemspec
Hunk #1 FAILED at 18.
1 out of 1 hunk FAILED
dpkg-source: info: the patch has fuzz which is not allowed, or is malformed
dpkg-source: info: if patch 'remove-appraisal.patch' is correctly applied by quilt, use 'quilt refresh' to update it
dpkg-source: info: restoring quilt backup files for remove-appraisal.patch
dpkg-source: error: LC_ALL=C patch -t -F 0 -N -p1 -u -V never -E -b -B .pc/remove-appraisal.patch/ --reject-file=- < ruby-invisible-captcha-1.1.0/debian/patches/remove-appraisal.patch subprocess returned exit status 1
E: Failed to run dpkg-source --before-build /home/janitor/tmp/tmphq06941l/build-area/ruby-invisible-captcha-1.1.0
brz: ERROR: The build failed.

Summary

Merged new upstream version: 2.0.0 (was: 1.1.0).

Full worker log Full build log