Run of fresh-releases for ruby-packetfu

Try this locally (using silver-platter):

debian-svp new-upstream ruby-packetfu 
138
139
140
141
142
143
144
145
146
147
dpkg-source: error: cannot represent change to test/sample-ipv6.pcapng: binary file contents changed
dpkg-source: error: add test/sample-ipv6.pcapng in debian/source/include-binaries if you want to store the modified binary in the debian tarball
dpkg-source: error: cannot represent change to test/sample-spb.pcapng: binary file contents changed
dpkg-source: error: add test/sample-spb.pcapng in debian/source/include-binaries if you want to store the modified binary in the debian tarball
dpkg-source: error: cannot represent change to test/sample.pcapng: binary file contents changed
dpkg-source: error: add test/sample.pcapng in debian/source/include-binaries if you want to store the modified binary in the debian tarball
dpkg-source: error: cannot represent change to test/sample2.pcapng: binary file contents changed
dpkg-source: error: add test/sample2.pcapng in debian/source/include-binaries if you want to store the modified binary in the debian tarball
E: Failed to package source directory /home/janitor/tmp/tmp162xerxw/build-area/ruby-packetfu-1.1.11
brz: ERROR: The build failed.

Summary

Merged new upstream version: 1.1.13 (was: 1.1.11).

Full worker log Full build log