Run of fresh-releases for ruby-rack-test

Try this locally (using silver-platter):

debian-svp new-upstream ruby-rack-test 
1
2
3
4
5
6
7
8
9
10
11
12
13
14
15
16
17
18
19
20
21
22
23
24
25
26
27
28
29
30
31
32
33
34
35
36
37
38
39
40
41
42
43
44
45
46
47
48
49
50
51
52
53
54
55
56
57
58
59
60
61
62
63
64
65
66
67
68
69
70
71
72
73
74
75
76
77
78
79
80
81
82
83
84
85
86
87
88
89
90
91
92
93
94
95
96
97
98
99
100
101
102
103
104
105
106
107
108
109
110
111
112
113
114
115
116
117
118
119
120
121
122
123
124
125
126
127
128
129
130
131
132
133
134
135
136
137
138
139
140
141
142
143
144
145
146
147
148
149
150
151
152
153
154
155
156
157
158
159
160
161
162
163
164
165
166
167
168
169
170
171
172
173
174
175
176
177
178
Processing: ruby-rack-test
Total 0 (delta 0), reused 0 (delta 0)
/usr/lib/python3/dist-packages/debian/copyright.py:652: UserWarning: Fixing Format URL
  warnings.warn('Fixing Format URL')
Using upstream branch https://github.com/brynary/rack-test (guessed)
Total 2607 (delta 8), reused 10 (delta 2), pack-reused 2585
uscan warn: redirecting DEPRECATED pkg-ruby-extras.alioth.debian.org/cgi-bin/gemwatch to gemwatch.debian.net
redirecting DEPRECATED pkg-ruby-extras.alioth.debian.org/cgi-bin/gemwatch to gemwatch.debian.net
Using version string 1.1.0.
No upstream upstream-revision format specified, trying tag:1.1.0
No upstream upstream-revision format specified, trying tag:ruby-rack-test-1.1.0
No upstream upstream-revision format specified, trying tag:v1.1.0
Using uscan to look for the upstream tarball.
uscan warn: redirecting DEPRECATED pkg-ruby-extras.alioth.debian.org/cgi-bin/gemwatch to gemwatch.debian.net
redirecting DEPRECATED pkg-ruby-extras.alioth.debian.org/cgi-bin/gemwatch to gemwatch.debian.net
Total 2568 (delta 0), reused 0 (delta 0), pack-reused 2565
v0.8.3 does not point to a valid object
/usr/lib/python3/dist-packages/dulwich/repo.py:393: UserWarning: ref refs/tags/v0.5.4 points at non-present sha 86640d127a8f7c400347eabd7dd92d1f35975932
  UserWarning)
/usr/lib/python3/dist-packages/dulwich/repo.py:393: UserWarning: ref refs/tags/v0.6.2 points at non-present sha 69d7f695ae5559169c1ebf671b7b34f81003ef5c
  UserWarning)
/usr/lib/python3/dist-packages/dulwich/repo.py:393: UserWarning: ref refs/tags/v0.7.0 points at non-present sha d5b1f30733bbc332d0ba50015c17312c13cd4d80
  UserWarning)
/usr/lib/python3/dist-packages/dulwich/repo.py:393: UserWarning: ref refs/tags/v0.2.0 points at non-present sha 4b3a7a9617103e6cb66c2ee94247729c4ffc23f0
  UserWarning)
/usr/lib/python3/dist-packages/dulwich/repo.py:393: UserWarning: ref refs/tags/v0.6.0 points at non-present sha 6b7338a31cb34f21c92a1203897ed4887df693d2
  UserWarning)
/usr/lib/python3/dist-packages/dulwich/repo.py:393: UserWarning: ref refs/tags/v0.6.1 points at non-present sha 8f59c207fe349ceeb700e536b3d90eae11032078
  UserWarning)
/usr/lib/python3/dist-packages/dulwich/repo.py:393: UserWarning: ref refs/tags/v0.1.0 points at non-present sha d7abce9f9f9a5449ce3284c96da159b44e423ee3
  UserWarning)
/usr/lib/python3/dist-packages/dulwich/repo.py:393: UserWarning: ref refs/tags/v0.3.0 points at non-present sha fac4b25bb0c8e67037bb26a63768c08823b01570
  UserWarning)
/usr/lib/python3/dist-packages/dulwich/repo.py:393: UserWarning: ref refs/tags/v0.6.3 points at non-present sha aa8cdd4f307556e809f09a5d034e03bea1354c62
  UserWarning)
/usr/lib/python3/dist-packages/dulwich/repo.py:393: UserWarning: ref refs/tags/v0.5.5 points at non-present sha 25f2fde6935f05b72a608750268a5a1c677d2851
  UserWarning)
/usr/lib/python3/dist-packages/dulwich/repo.py:393: UserWarning: ref refs/tags/v0.4.0 points at non-present sha dcdcfdf127b1aa8790f0d607ec7b9b874db62ae3
  UserWarning)
/usr/lib/python3/dist-packages/dulwich/repo.py:393: UserWarning: ref refs/tags/v0.5.6 points at non-present sha 0837ae484935fd2aecd4e408ad419b8de632d57a
  UserWarning)
/usr/lib/python3/dist-packages/dulwich/repo.py:393: UserWarning: ref refs/tags/v0.8.0 points at non-present sha dfac198cdf4262116b329b4dad042f1ae6a24696
  UserWarning)
/usr/lib/python3/dist-packages/dulwich/repo.py:393: UserWarning: ref refs/tags/v0.8.2 points at non-present sha 8f014e34f43e27c57f3f10216a7883589e3e8bd3
  UserWarning)
/usr/lib/python3/dist-packages/dulwich/repo.py:393: UserWarning: ref refs/tags/v0.5.7 points at non-present sha b90a243a8e9ad7466ba5b038dd7042c55d9a2972
  UserWarning)
/usr/lib/python3/dist-packages/dulwich/repo.py:393: UserWarning: ref refs/tags/v0.5.2 points at non-present sha 3e1564e33efaf93e7547dc4f7592a4b16a600aa5
  UserWarning)
/usr/lib/python3/dist-packages/dulwich/repo.py:393: UserWarning: ref refs/tags/v0.5.1 points at non-present sha 92a12ea83bac1cce20356e6e4bd41a02184efb17
  UserWarning)
/usr/lib/python3/dist-packages/dulwich/repo.py:393: UserWarning: ref refs/tags/v1.0.0 points at non-present sha f4bb929497c65f2631dd42ef48f6bfaa8ef9dc58
  UserWarning)
/usr/lib/python3/dist-packages/dulwich/repo.py:393: UserWarning: ref refs/tags/v0.5.3 points at non-present sha 75bd35442b5dcb732a601eceeb97d854d23a1601
  UserWarning)
Not storing pristine-tar metadata, since there is no pristine-tar branch.
/usr/lib/python3/dist-packages/dulwich/repo.py:393: UserWarning: ref refs/tags/v0.5.4 points at non-present sha 86640d127a8f7c400347eabd7dd92d1f35975932
  UserWarning)
/usr/lib/python3/dist-packages/dulwich/repo.py:393: UserWarning: ref refs/tags/v0.6.2 points at non-present sha 69d7f695ae5559169c1ebf671b7b34f81003ef5c
  UserWarning)
/usr/lib/python3/dist-packages/dulwich/repo.py:393: UserWarning: ref refs/tags/v0.7.0 points at non-present sha d5b1f30733bbc332d0ba50015c17312c13cd4d80
  UserWarning)
/usr/lib/python3/dist-packages/dulwich/repo.py:393: UserWarning: ref refs/tags/v0.2.0 points at non-present sha 4b3a7a9617103e6cb66c2ee94247729c4ffc23f0
  UserWarning)
/usr/lib/python3/dist-packages/dulwich/repo.py:393: UserWarning: ref refs/tags/v0.6.0 points at non-present sha 6b7338a31cb34f21c92a1203897ed4887df693d2
  UserWarning)
/usr/lib/python3/dist-packages/dulwich/repo.py:393: UserWarning: ref refs/tags/v0.6.1 points at non-present sha 8f59c207fe349ceeb700e536b3d90eae11032078
  UserWarning)
/usr/lib/python3/dist-packages/dulwich/repo.py:393: UserWarning: ref refs/tags/v0.1.0 points at non-present sha d7abce9f9f9a5449ce3284c96da159b44e423ee3
  UserWarning)
/usr/lib/python3/dist-packages/dulwich/repo.py:393: UserWarning: ref refs/tags/v0.3.0 points at non-present sha fac4b25bb0c8e67037bb26a63768c08823b01570
  UserWarning)
/usr/lib/python3/dist-packages/dulwich/repo.py:393: UserWarning: ref refs/tags/v0.6.3 points at non-present sha aa8cdd4f307556e809f09a5d034e03bea1354c62
  UserWarning)
/usr/lib/python3/dist-packages/dulwich/repo.py:393: UserWarning: ref refs/tags/v0.5.5 points at non-present sha 25f2fde6935f05b72a608750268a5a1c677d2851
  UserWarning)
/usr/lib/python3/dist-packages/dulwich/repo.py:393: UserWarning: ref refs/tags/v0.4.0 points at non-present sha dcdcfdf127b1aa8790f0d607ec7b9b874db62ae3
  UserWarning)
/usr/lib/python3/dist-packages/dulwich/repo.py:393: UserWarning: ref refs/tags/v0.5.6 points at non-present sha 0837ae484935fd2aecd4e408ad419b8de632d57a
  UserWarning)
/usr/lib/python3/dist-packages/dulwich/repo.py:393: UserWarning: ref refs/tags/v0.8.0 points at non-present sha dfac198cdf4262116b329b4dad042f1ae6a24696
  UserWarning)
/usr/lib/python3/dist-packages/dulwich/repo.py:393: UserWarning: ref refs/tags/v0.8.2 points at non-present sha 8f014e34f43e27c57f3f10216a7883589e3e8bd3
  UserWarning)
/usr/lib/python3/dist-packages/dulwich/repo.py:393: UserWarning: ref refs/tags/v0.5.7 points at non-present sha b90a243a8e9ad7466ba5b038dd7042c55d9a2972
  UserWarning)
/usr/lib/python3/dist-packages/dulwich/repo.py:393: UserWarning: ref refs/tags/v0.5.2 points at non-present sha 3e1564e33efaf93e7547dc4f7592a4b16a600aa5
  UserWarning)
/usr/lib/python3/dist-packages/dulwich/repo.py:393: UserWarning: ref refs/tags/v0.5.1 points at non-present sha 92a12ea83bac1cce20356e6e4bd41a02184efb17
  UserWarning)
/usr/lib/python3/dist-packages/dulwich/repo.py:393: UserWarning: ref refs/tags/v1.0.0 points at non-present sha f4bb929497c65f2631dd42ef48f6bfaa8ef9dc58
  UserWarning)
/usr/lib/python3/dist-packages/dulwich/repo.py:393: UserWarning: ref refs/tags/v0.5.3 points at non-present sha 75bd35442b5dcb732a601eceeb97d854d23a1601
  UserWarning)
v0.5.4 does not point to a valid object
v1.1.0 does not point to a valid object
v0.6.2 does not point to a valid object
v0.7.0 does not point to a valid object
v0.2.0 does not point to a valid object
v0.6.0 does not point to a valid object
v0.6.1 does not point to a valid object
v0.1.0 does not point to a valid object
v0.3.0 does not point to a valid object
v0.6.3 does not point to a valid object
v0.5.5 does not point to a valid object
v0.4.0 does not point to a valid object
v0.5.6 does not point to a valid object
v0.8.0 does not point to a valid object
v0.8.2 does not point to a valid object
v0.5.7 does not point to a valid object
v0.5.2 does not point to a valid object
v0.5.1 does not point to a valid object
v1.0.0 does not point to a valid object
v0.5.3 does not point to a valid object
All changes applied successfully.
v0.5.4 does not point to a valid object
v1.1.0 does not point to a valid object
v0.6.2 does not point to a valid object
v0.7.0 does not point to a valid object
v0.2.0 does not point to a valid object
v0.6.0 does not point to a valid object
v0.6.1 does not point to a valid object
v0.1.0 does not point to a valid object
v0.3.0 does not point to a valid object
v0.6.3 does not point to a valid object
v0.5.5 does not point to a valid object
v0.4.0 does not point to a valid object
v0.5.6 does not point to a valid object
v0.8.0 does not point to a valid object
v0.8.2 does not point to a valid object
v0.5.7 does not point to a valid object
v0.5.2 does not point to a valid object
v0.5.1 does not point to a valid object
v1.0.0 does not point to a valid object
v0.5.3 does not point to a valid object
Committing to: /home/janitor/tmp/tmpqwfrkwao/ruby-rack-test/
modified History.md
modified README.md
modified debian/changelog
modified lib/rack/mock_session.rb
modified lib/rack/test/cookie_jar.rb
modified lib/rack/test/methods.rb
modified lib/rack/test/mock_digest_request.rb
modified lib/rack/test/uploaded_file.rb
modified lib/rack/test/utils.rb
modified lib/rack/test/version.rb
modified lib/rack/test.rb
modified rack-test.gemspec
Committed revision 41.
Worker failed: An error (1) occurred refreshing quilt patches: None

Applying patch debian/patches/0001-Import-upstream-rspec-files.patch
patching file spec/fixtures/bar.txt
patching file spec/fixtures/config.ru
patching file spec/fixtures/fake_app.rb
patching file spec/fixtures/foo.txt
patching file spec/rack/test/cookie_jar_spec.rb
patching file spec/rack/test/cookie_object_spec.rb
patching file spec/rack/test/cookie_spec.rb
patching file spec/rack/test/digest_auth_spec.rb
patching file spec/rack/test/multipart_spec.rb
patching file spec/rack/test/uploaded_file_spec.rb
patching file spec/rack/test/utils_spec.rb
patching file spec/rack/test_spec.rb
patching file spec/spec_helper.rb
patching file spec/support/matchers/body.rb
patching file spec/support/matchers/challenge.rb
Refreshed patch debian/patches/0001-Import-upstream-rspec-files.patch

Applying patch debian/patches/0002-Drop-code-climate-reporter.patch
patching file rack-test.gemspec
Hunk #1 FAILED at 23.
Hunk #2 FAILED at 32.
Hunk #3 FAILED at 42.
3 out of 3 hunks FAILED -- rejects in file rack-test.gemspec
Patch debian/patches/0002-Drop-code-climate-reporter.patch does not apply (enforce with -f)

Elapsed time: 0:00:46.544846

Full worker log