Run of lintian-fixes for ruby-rake-ant

Try this locally (using the lintian-brush package):

debcheckout ruby-rake-ant
cd ruby-rake-ant
lintian-brush
1134
1135
1136
1137
1138
1139
1140
1141
1142
1143
1144
1145
1146
1147
1148
dpkg-buildpackage: info: source changed by Debian Janitor <janitor@jelmer.uk>
 dpkg-source --before-build .
dpkg-buildpackage: info: host architecture amd64
 debian/rules clean
dh clean --buildsystem=ruby --with ruby
   dh_auto_clean -O--buildsystem=ruby
	dh_ruby --clean
/usr/lib/ruby/vendor_ruby/gem2deb/source.rb:41:in `packages': undefined method `[]=' for nil:NilClass (NoMethodError)
	from /usr/lib/ruby/vendor_ruby/gem2deb/dh_ruby.rb:165:in `installers'
	from /usr/lib/ruby/vendor_ruby/gem2deb/dh_ruby.rb:45:in `clean'
	from /usr/bin/dh_ruby:91:in `<main>'
   dh_ruby --clean
dh_auto_clean: error: dh_ruby --clean returned exit code 1
make: *** [debian/rules:7: clean] Error 25
dpkg-buildpackage: error: debian/rules clean subprocess returned exit status 2

Summary

  • Fix field name cases in debian/control (Depends => depends, Package => package, Priority => priority, Rules-Requires-Root => rules-requires-root, Source => source, Standards-Version => standards-version, Testsuite => testsuite, Uploaders => uploaders, Vcs-Browser => vcs-browser). (cute-field)

Full worker log Full build log